Subject ID*,OUTCOME_2,PT_NAME2,OUTCOME_1,PT_NAME1,AGE*,SURVIVAL_LENGTH,GENDER,DISEASE_TYPE,RACE,WHO_GRADE,INSTITUTION_NAME,K1_VALUE,K1_MONTH,K2_VALUE,K2_MONTH
HF0442.5,,,,,45-49,588,M,GBM,,IV,HENRY FORD HOSPITAL (RETRO),,,,
E10003,,,CR - COMPLETE RESECTION,CRANIOTOMY OPEN RESECTION,60-64,316,M,UNKNOWN,WHITE,,NABTT/HENRY FORD HOSPITAL,50,4,50,
HF1568,,,,,30-34,1278,F,ASTROCYTOMA,WHITE,II,HENRY FORD HOSPITAL (RETRO),100,,,
E10067,,,,,70-74,,M,UNKNOWN,WHITE,,NABTT/H. LEE MOFFITT CANCER CENTER,70,6,50,8
E09358,,,PR - PARTIAL RESECTION,CRANIOTOMY OPEN RESECTION,50-54,3814,F,MIXED,WHITE,II,UCSF,,8,90,15
E09951,,,CR - COMPLETE RESECTION,CRANIOTOMY OPEN RESECTION,45-49,677,M,GBM,WHITE,,UNIV OF PITTSBURGH,100,6,90,12
E09976,,,,,40-44,661,F,GBM,WHITE,,NABTT/HENRY FORD HOSPITAL,80,6,80,12
E09623,CR - COMPLETE RESECTION,CRANIOTOMY OPEN RESECTION,CR - COMPLETE RESECTION,CRANIOTOMY OPEN RESECTION,65-69,621,M,GBM,WHITE,,UNIV OF PITTSBURGH,,,,
E09611,BX - BIOPSY ONLY,CRANIOTOMY OPEN BIOPSY,BX - BIOPSY ONLY,CRANIOTOMY OPEN BIOPSY,65-69,5497,M,UNKNOWN,ASIAN,,NIH NEURO-ONCOLOGY BRANCH,100,12,80,18
E09975,,,,,30-34,1102,M,UNKNOWN,WHITE,,NIH NEURO-ONCOLOGY BRANCH,100,13,100,20
E09670,,,PR - PARTIAL RESECTION,CRANIOTOMY OPEN RESECTION,70-74,425,M,GBM,WHITE,,NABTT/H. LEE MOFFITT CANCER CENTER,50,1,,
E09605,,,PR - PARTIAL RESECTION,CRANIOTOMY OPEN RESECTION,60-64,1780,M,GBM,WHITE,IV,UCSF,,,,
HF1313,,,,,,,,,,,HENRY FORD HOSPITAL (RETRO),,,,
E10483,CR - COMPLETE RESECTION,CRANIOTOMY OPEN RESECTION,BX - BIOPSY ONLY,CRANIOTOMY OPEN BIOPSY,25-29,1993,M,ASTROCYTOMA,WHITE,II,NIH NEURO-ONCOLOGY BRANCH,100,5,,
E09167,,,CR - COMPLETE RESECTION,CRANIOTOMY OPEN RESECTION,65-69,527,M,UNKNOWN,WHITE,,DANA-FARBER CANCER INSTITUTE,60,5,,
E09855,,,PR - PARTIAL RESECTION,CRANIOTOMY OPEN RESECTION,25-29,1153,M,ASTROCYTOMA,WHITE,III,UCSF,90,3,100,10
E09615,,,CR - COMPLETE RESECTION,CRANIOTOMY OPEN RESECTION,45-49,889,M,GBM,WHITE,IV,NIH NEURO-ONCOLOGY BRANCH,,,,
E09993,CR - COMPLETE RESECTION,CRANIOTOMY OPEN RESECTION,CR - COMPLETE RESECTION,CRANIOTOMY OPEN RESECTION,40-44,455,M,UNKNOWN,WHITE,,NABTT/HENRY FORD HOSPITAL,60,5,,
HF1677,,,,,50-54,1905,M,ASTROCYTOMA,WHITE,II,HENRY FORD HOSPITAL (RETRO),100,,,
E10615,,,UNKNOWN,CRANIOTOMY OPEN RESECTION,45-49,,M,ASTROCYTOMA,WHITE,III,NIH NEURO-ONCOLOGY BRANCH,80,4,,
HF0435,,,,,40-44,3315,O,ASTROCYTOMA,,III,HENRY FORD HOSPITAL (RETRO),,,,
HF1178,,,,,70-74,474,O,GBM,,IV,HENRY FORD HOSPITAL (RETRO),,,,
3089254,,,,,,,,,,,TJU,,,,
HF1122,,,,,35-39,219,M,GBM,WHITE,IV,HENRY FORD HOSPITAL (RETRO),90,,,
E09852,PR - PARTIAL RESECTION,CRANIOTOMY OPEN RESECTION,CR - COMPLETE RESECTION,CRANIOTOMY OPEN RESECTION,45-49,1448,F,GBM,WHITE,,UCLA SCHOOL OF MEDICINE,,,,
E09921,,,CR - COMPLETE RESECTION,CRANIOTOMY OPEN RESECTION,40-44,1093,F,ASTROCYTOMA,WHITE,,NABTT/HENRY FORD HOSPITAL,70,7,90,15
E09446,,,,,25-29,,F,GBM,WHITE,,NIH NEURO-ONCOLOGY BRANCH,90,1,,
E09646,,,,,20-24,2723,F,,WHITE,,NIH NEURO-ONCOLOGY BRANCH,100,19,,29
E10080,,,,,85-89,,F,,WHITE,,NABTT/H. LEE MOFFITT CANCER CENTER,70,6,70,12
NT7,,,,,,,,NON_TUMOR,UNKNOWN,,NIH NEURO-ONCOLOGY BRANCH,,,,
HF0526,,,,,40-44,,O,NON_TUMOR,,,HENRY FORD HOSPITAL (RETRO),,,,
900_00_5468,,,,,,300,,ASTROCYTOMA,,II,TJU,,,,
900_00_5547,,,,,,240,,OLIGODENDROGLIOMA,,II,TJU,,,,
E09137,,,PR - PARTIAL RESECTION,CRANIOTOMY OPEN RESECTION,50-54,,M,GBM,WHITE,IV,NIH NEURO-ONCOLOGY BRANCH,100,6,80,12
E09846,,,BX - BIOPSY ONLY,STEREOTACTIC BIOPSY,70-74,429,M,GBM,WHITE,,NABTT/H. LEE MOFFITT CANCER CENTER,50,6,,
HF1167,,,,,45-49,537,M,OLIGODENDROGLIOMA,BLACK,II,HENRY FORD HOSPITAL (RETRO),,,,
E09595,,,PR - PARTIAL RESECTION,CRANIOTOMY OPEN RESECTION,50-54,1741,F,UNKNOWN,WHITE,,NIH NEURO-ONCOLOGY BRANCH,60,1,,
E10026,CR - COMPLETE RESECTION,CRANIOTOMY OPEN RESECTION,CR - COMPLETE RESECTION,CRANIOTOMY OPEN RESECTION,65-69,463,M,GBM,WHITE,,NIH NEURO-ONCOLOGY BRANCH,80,,,
HF1345,,,,,15-19,2505,F,ASTROCYTOMA,BLACK,II,HENRY FORD HOSPITAL (RETRO),,,,
900_00_5477,,,,,,150,,ASTROCYTOMA,,II,TJU,,,,
HF1553,,,,,10-14,2136,M,OLIGODENDROGLIOMA,WHITE,II,HENRY FORD HOSPITAL (RETRO),100,,,
E10072,,,,,20-24,1116,M,OLIGODENDROGLIOMA,WHITE,,NABTT/HENRY FORD HOSPITAL,100,12,90,18
HF0295,,,,,40-44,5108,O,NON_TUMOR,,,HENRY FORD HOSPITAL (RETRO),,,,
E10284,,,CR - COMPLETE RESECTION,CRANIOTOMY OPEN RESECTION,55-59,145,M,GBM,WHITE,,UNIV OF PITTSBURGH,,,,
E10105,,,,,40-44,32,M,ASTROCYTOMA,WHITE,III,NIH NEURO-ONCOLOGY BRANCH,,,,
E10888,,,PR - PARTIAL RESECTION,CRANIOTOMY OPEN RESECTION,45-49,,F,GBM,WHITE,,NIH NEURO-ONCOLOGY BRANCH,,,,
E09743,,,BX - BIOPSY ONLY,CRANIOTOMY OPEN BIOPSY,40-44,,F,ASTROCYTOMA,WHITE,III,NABTT/H. LEE MOFFITT CANCER CENTER,100,6,90,12
HF1409,,,,,50-54,381,M,ASTROCYTOMA,WHITE,III,HENRY FORD HOSPITAL (RETRO),90,,,
E09601,,,PR - PARTIAL RESECTION,CRANIOTOMY OPEN RESECTION,40-44,395,M,GBM,WHITE,IV,NIH NEURO-ONCOLOGY BRANCH,70,6,,
E09891,,,BX - BIOPSY ONLY,STEREOTACTIC BIOPSY,35-39,753,M,ASTROCYTOMA,WHITE,,NIH NEURO-ONCOLOGY BRANCH,100,4,80,11
HF1380,,,,,35-39,,O,ASTROCYTOMA,,II,HENRY FORD HOSPITAL (RETRO),,,,
E09503,,,PR - PARTIAL RESECTION,CRANIOTOMY OPEN RESECTION,45-49,,F,OLIGODENDROGLIOMA,WHITE,II,UCSF,,6,,10
HF0802,,,,,30-34,2641,O,ASTROCYTOMA,,II,HENRY FORD HOSPITAL (RETRO),,,,
E09945,,,BX - BIOPSY ONLY,CRANIOTOMY OPEN BIOPSY,25-29,,M,UNKNOWN,WHITE,,UNIVERSITY OF WISCONSIN,90,6,90,12
HF1059,,,,,60-64,344,F,MIXED,WHITE,III,HENRY FORD HOSPITAL (RETRO),,,,
E09752,,,,,55-59,,M,GBM,WHITE,IV,NABTT/H. LEE MOFFITT CANCER CENTER,70,4,70,10
MD607216,,,CR - COMPLETE RESECTION,CRANIOTOMY OPEN RESECTION,70-74,333,M,GBM,WHITE,IV,M. D. ANDERSON CANCER CENTER,50,6,,
E10012,,,,,70-74,,M,GBM,WHITE,IV,NABTT/H. LEE MOFFITT CANCER CENTER,80,6,90,12
E10662,PR - PARTIAL RESECTION,CRANIOTOMY OPEN RESECTION,CR - COMPLETE RESECTION,CRANIOTOMY OPEN RESECTION,45-49,,M,GBM,WHITE,,NIH NEURO-ONCOLOGY BRANCH,90,,,
E09511,,,BX - BIOPSY ONLY,CRANIOTOMY OPEN BIOPSY,45-49,370,M,MIXED,WHITE,III,UCSF,90,5,,
HF0996,,,,,50-54,3614,F,GBM,WHITE,IV,HENRY FORD HOSPITAL (RETRO),90,,,
HF1319,,,,,35-39,,O,ASTROCYTOMA,,II,HENRY FORD HOSPITAL (RETRO),,,,
E10102,,,PR - PARTIAL RESECTION,CRANIOTOMY OPEN RESECTION,50-54,1164,M,GBM,WHITE,,UCSF,70,4,80,9
900_00_5384,,,,,,270,,GBM,,,TJU,,,,
E09610,PR - PARTIAL RESECTION,CRANIOTOMY OPEN RESECTION,PR - PARTIAL RESECTION,CRANIOTOMY OPEN RESECTION,55-59,376,M,GBM,WHITE,IV,NIH NEURO-ONCOLOGY BRANCH,,,,
E10182,,,PR - PARTIAL RESECTION,CRANIOTOMY OPEN RESECTION,25-29,,M,ASTROCYTOMA,BLACK,,NIH NEURO-ONCOLOGY BRANCH,100,,,
900_00_53_32,,,,,,450,,GBM,,,TJU,,,,
3513467,,,,,,,,,,,TJU,,,,
HF0251,,,,,50-54,682,O,OLIGODENDROGLIOMA,,III,HENRY FORD HOSPITAL (RETRO),,,,
HF0189,,,,,30-34,3810,M,ASTROCYTOMA,,III,HENRY FORD HOSPITAL (RETRO),,,,
E10158,,,CR - COMPLETE RESECTION,CRANIOTOMY OPEN RESECTION,45-49,1219,F,GBM,WHITE,,NIH NEURO-ONCOLOGY BRANCH,100,5,100,11
HF1246,,,,,65-69,6,M,ASTROCYTOMA,WHITE,II,HENRY FORD HOSPITAL (RETRO),80,,,
HF1077,,,,,40-44,2201,M,GBM,BLACK,IV,HENRY FORD HOSPITAL (RETRO),,,,
HF0844,,,,,30-34,1915,O,ASTROCYTOMA,,II,HENRY FORD HOSPITAL (RETRO),,,,
E09818,,,BX - BIOPSY ONLY,STEREOTACTIC BIOPSY,30-34,1144,M,ASTROCYTOMA,ASIAN,,UCSF,90,5,90,10
HF0350,,,,,55-59,618,F,GBM,,IV,HENRY FORD HOSPITAL (RETRO),,,,
HF0268,,,,,45-49,657,F,GBM,,I,HENRY FORD HOSPITAL (RETRO),,,,
E09151,PR - PARTIAL RESECTION,CRANIOTOMY OPEN RESECTION,BX - BIOPSY ONLY,STEREOTACTIC BIOPSY,20-24,,M,UNKNOWN,WHITE,,NIH NEURO-ONCOLOGY BRANCH,100,5,100,7
E10271,,,CR - COMPLETE RESECTION,CRANIOTOMY OPEN RESECTION,70-74,376,M,GBM,WHITE,,DANA-FARBER CANCER INSTITUTE,20,1,,
E09397,,,CR - COMPLETE RESECTION,CRANIOTOMY OPEN RESECTION,35-39,1942,M,OLIGODENDROGLIOMA,WHITE,,UCSF,90,6,90,11
HF0218,,,,,70-74,,O,OLIGODENDROGLIOMA,,II,HENRY FORD HOSPITAL (RETRO),,,,
E10857,PR - PARTIAL RESECTION,CRANIOTOMY OPEN RESECTION,PR - PARTIAL RESECTION,CRANIOTOMY OPEN RESECTION,55-59,,M,GBM,WHITE,,NIH NEURO-ONCOLOGY BRANCH,,,,
HF0300.3,,,,,30-34,1736,O,GBM,,IV,HENRY FORD HOSPITAL (RETRO),,,,
HF0891,,,,,45-49,864,O,GBM,,IV,HENRY FORD HOSPITAL (RETRO),,,,
HF1232,,,,,50-54,606,F,ASTROCYTOMA,WHITE,III,HENRY FORD HOSPITAL (RETRO),100,,,
3513138,,,,,,,,,,,TJU,,,,
E10210,,,,,15-19,,F,,OTHER,,NIH NEURO-ONCOLOGY BRANCH,90,3,90,9
NT1,,,,,,,,NON_TUMOR,UNKNOWN,,NIH NEURO-ONCOLOGY BRANCH,,,,
E10444,PR - PARTIAL RESECTION,CRANIOTOMY OPEN RESECTION,PR - PARTIAL RESECTION,CRANIOTOMY OPEN RESECTION,40-44,509,M,GBM,WHITE,IV,NIH NEURO-ONCOLOGY BRANCH,,,,
HF1097,,,,,50-54,270,F,GBM,WHITE,IV,HENRY FORD HOSPITAL (RETRO),90,,,
HF0026,,,,,60-64,1712,F,ASTROCYTOMA,,II,HENRY FORD HOSPITAL (RETRO),,,,
HF0066,,,,,55-59,274,O,GBM,,IV,HENRY FORD HOSPITAL (RETRO),,,,
900_00_5489,,,,,,240,,GBM,,,TJU,,,,
E09690,,,PR - PARTIAL RESECTION,CRANIOTOMY OPEN RESECTION,40-44,1869,M,GBM,WHITE,IV,UCSF,,6,,8
HF0244,,,,,60-64,225,M,ASTROCYTOMA,,III,HENRY FORD HOSPITAL (RETRO),,,,
HF1581,,,,,65-69,7,O,ASTROCYTOMA,,III,HENRY FORD HOSPITAL (RETRO),,,,
900_00_5381,,,,,,120,,GBM,,,TJU,,,,
3497265,,,,,,,,,,,TJU,,,,
HF0089,,,,,65-69,237,F,ASTROCYTOMA,,III,HENRY FORD HOSPITAL (RETRO),,,,
E10009,,,,,45-49,1096,M,OLIGODENDROGLIOMA,WHITE,,NABTT/HENRY FORD HOSPITAL,100,7,100,12
E09730,PR - PARTIAL RESECTION,CRANIOTOMY OPEN RESECTION,PR - PARTIAL RESECTION,CRANIOTOMY OPEN RESECTION,40-44,1851,M,GBM,WHITE,IV,NIH NEURO-ONCOLOGY BRANCH,,,,
E09892,,,BX - BIOPSY ONLY,CRANIOTOMY OPEN BIOPSY,20-24,1165,F,ASTROCYTOMA,WHITE,,NIH NEURO-ONCOLOGY BRANCH,100,4,100,12
HF0180,,,,,70-74,10,O,GBM,,IV,HENRY FORD HOSPITAL (RETRO),,,,
E09963,,,,,75-79,,F,UNKNOWN,WHITE,,NABTT/H. LEE MOFFITT CANCER CENTER,50,6,,
HF1560,,,,,75-79,35,F,GBM,WHITE,IV,HENRY FORD HOSPITAL (RETRO),80,,,
E10690,,,PR - PARTIAL RESECTION,CRANIOTOMY OPEN RESECTION,35-39,,M,MIXED,WHITE,,NIH NEURO-ONCOLOGY BRANCH,,,,
E09936,,,PR - PARTIAL RESECTION,CRANIOTOMY OPEN RESECTION,70-74,80,M,GBM,WHITE,,NABTT/HENRY FORD HOSPITAL,50,2,,
HF0654,,,,,55-59,439,O,GBM,,IV,HENRY FORD HOSPITAL (RETRO),,,,
3504050,,,,,,,,,,,TJU,,,,
HF1494,,,,,30-34,1023,M,ASTROCYTOMA,WHITE,III,HENRY FORD HOSPITAL (RETRO),100,,,
HF0599,,,,,50-54,1284,O,OLIGODENDROGLIOMA,,II,HENRY FORD HOSPITAL (RETRO),,,,
E09791,,,PR - PARTIAL RESECTION,CRANIOTOMY OPEN RESECTION,55-59,401,M,GBM,WHITE,IV,UCSF,,7,,
E09987,,,,,65-69,,M,,WHITE,,NABTT/H. LEE MOFFITT CANCER CENTER,,,,
E09495,CR - COMPLETE RESECTION,CRANIOTOMY OPEN RESECTION,CR - COMPLETE RESECTION,CRANIOTOMY OPEN RESECTION,20-24,456,F,UNKNOWN,WHITE,,NIH NEURO-ONCOLOGY BRANCH,100,6,,
E09587,,,,,35-39,346,M,UNKNOWN,WHITE,,NIH NEURO-ONCOLOGY BRANCH,100,12,,
HF0778,,,,,65-69,242,O,ASTROCYTOMA,,II,HENRY FORD HOSPITAL (RETRO),,,,
E09989,,,,,55-59,,M,UNKNOWN,WHITE,,NABTT/HENRY FORD HOSPITAL,70,,,
HF1032,,,,,40-44,843,M,ASTROCYTOMA,WHITE,III,HENRY FORD HOSPITAL (RETRO),100,,,
HF0312,,,,,25-29,4803,O,NON_TUMOR,,,HENRY FORD HOSPITAL (RETRO),,,,
E09900,,,CR - COMPLETE RESECTION,CRANIOTOMY OPEN RESECTION,50-54,,F,UNKNOWN,WHITE,,NABTT/H. LEE MOFFITT CANCER CENTER,80,3,,
HF0184,,,,,50-54,359,O,OLIGODENDROGLIOMA,,III,HENRY FORD HOSPITAL (RETRO),,,,
HF0142,,,,,70-74,8,O,GBM,,IV,HENRY FORD HOSPITAL (RETRO),,,,
HF0303,,,,,30-34,3605,O,NON_TUMOR,,,HENRY FORD HOSPITAL (RETRO),,,,
E09606,,,CR - COMPLETE RESECTION,CRANIOTOMY OPEN RESECTION,50-54,399,M,GBM,WHITE,IV,UCSF,0,4,,
E10746,,,PR - PARTIAL RESECTION,CRANIOTOMY OPEN RESECTION,20-24,,M,ASTROCYTOMA,WHITE,,NIH NEURO-ONCOLOGY BRANCH,,,,
HF1191,,,,,70-74,9,F,GBM,WHITE,IV,HENRY FORD HOSPITAL (RETRO),,,,
900_00_5396,,,,,,390,,GBM,,,TJU,,,,
E10077,,,PR - PARTIAL RESECTION,CRANIOTOMY OPEN RESECTION,30-34,775,M,GBM,WHITE,,UCSF,90,4,,10
HF1235,,,,,35-39,2951,M,ASTROCYTOMA,WHITE,II,HENRY FORD HOSPITAL (RETRO),90,,,
HF1702,,,,,75-79,162,F,OLIGODENDROGLIOMA,WHITE,III,HENRY FORD HOSPITAL (RETRO),80,,,
E09811,,,PR - PARTIAL RESECTION,CRANIOTOMY OPEN RESECTION,50-54,,M,ASTROCYTOMA,WHITE,II,NABTT/H. LEE MOFFITT CANCER CENTER,80,6,80,12
E09542,,,PR - PARTIAL RESECTION,CRANIOTOMY OPEN RESECTION,35-39,,M,ASTROCYTOMA,WHITE,II,UCSF,,,,
E09933,PR - PARTIAL RESECTION,CRANIOTOMY OPEN RESECTION,BX - BIOPSY ONLY,STEREOTACTIC BIOPSY,25-29,1371,M,ASTROCYTOMA,WHITE,,NIH NEURO-ONCOLOGY BRANCH,100,7,100,11
E09233,,,BX - BIOPSY ONLY,STEREOTACTIC BIOPSY,50-54,,M,GBM,WHITE,IV,NIH NEURO-ONCOLOGY BRANCH,,,,
E10097,,,,,55-59,1097,M,OLIGODENDROGLIOMA,WHITE,,NABTT/HENRY FORD HOSPITAL,100,6,100,12
E09681,,,CR - COMPLETE RESECTION,CRANIOTOMY OPEN RESECTION,35-39,3365,F,OLIGODENDROGLIOMA,WHITE,III,NABTT/H. LEE MOFFITT CANCER CENTER,80,5,70,12
HF0434,,,,,60-64,183,M,ASTROCYTOMA,,II,HENRY FORD HOSPITAL (RETRO),,,,
E10722,,,PR - PARTIAL RESECTION,CRANIOTOMY OPEN RESECTION,50-54,,M,GBM,WHITE,,NIH NEURO-ONCOLOGY BRANCH,,,,
E10514,PR - PARTIAL RESECTION,CRANIOTOMY OPEN RESECTION,PR - PARTIAL RESECTION,CRANIOTOMY OPEN RESECTION,25-29,712,M,GBM,WHITE,,NIH NEURO-ONCOLOGY BRANCH,80,2,,
E10481,,,CR - COMPLETE RESECTION,CRANIOTOMY OPEN RESECTION,65-69,,M,ASTROCYTOMA,WHITE,,NIH NEURO-ONCOLOGY BRANCH,80,6,,
HF0543,,,,,50-54,2028,M,GBM,WHITE,IV,HENRY FORD HOSPITAL (RETRO),,,,
NT3,,,,,,,,NON_TUMOR,UNKNOWN,,NIH NEURO-ONCOLOGY BRANCH,,,,
E10016,,,CR - COMPLETE RESECTION,CRANIOTOMY OPEN RESECTION,50-54,885,F,GBM,WHITE,,UCSF,70,5,,
E09494,,,,,20-24,,F,UNKNOWN,ASIAN,,NIH NEURO-ONCOLOGY BRANCH,100,6,100,36
E10647,,,CR - COMPLETE RESECTION,CRANIOTOMY OPEN RESECTION,40-44,,M,ASTROCYTOMA,WHITE,,NIH NEURO-ONCOLOGY BRANCH,100,4,,
E09971,,,BX - BIOPSY ONLY,CRANIOTOMY OPEN BIOPSY,40-44,261,F,UNKNOWN,WHITE,,NABTT/H. LEE MOFFITT CANCER CENTER,90,6,,
E09847,,,BX - BIOPSY ONLY,CRANIOTOMY OPEN RESECTION,65-69,924,F,GBM,WHITE,IV,UCSF,,4,,8
HF0608,,,,,50-54,317,M,ASTROCYTOMA,WHITE,II,HENRY FORD HOSPITAL (RETRO),,,,
900_00_5404,,,,,,360,,GBM,,,TJU,,,,
E09888,,,,,75-79,,M,UNKNOWN,WHITE,,NABTT/H. LEE MOFFITT CANCER CENTER,90,5,70,33
HF1316,,,,,70-74,207,F,ASTROCYTOMA,BLACK,II,HENRY FORD HOSPITAL (RETRO),,,,
E10002,CR - COMPLETE RESECTION,CRANIOTOMY OPEN RESECTION,BX - BIOPSY ONLY,STEREOTACTIC BIOPSY,60-64,251,M,GBM,WHITE,IV,UCLA SCHOOL OF MEDICINE,90,5,,
E10023,,,,,30-34,1096,M,UNKNOWN,WHITE,,NABTT/HENRY FORD HOSPITAL,90,6,,
E10691,,,BX - BIOPSY ONLY,STEREOTACTIC BIOPSY,60-64,,F,OLIGODENDROGLIOMA,WHITE,,NIH NEURO-ONCOLOGY BRANCH,,,,
E10162,PR - PARTIAL RESECTION,CRANIOTOMY OPEN RESECTION,PR - PARTIAL RESECTION,CRANIOTOMY OPEN RESECTION,55-59,463,F,ASTROCYTOMA,WHITE,III,NIH NEURO-ONCOLOGY BRANCH,,4,,
81668782,,,,,,,,,,,TJU,,,,
E09448,CR - COMPLETE RESECTION,CRANIOTOMY OPEN RESECTION,PR - PARTIAL RESECTION,CRANIOTOMY OPEN RESECTION,40-44,6873,F,OLIGODENDROGLIOMA,WHITE,III,UCSF,40,,,
HF1475,,,,,15-19,951,M,ASTROCYTOMA,WHITE,III,HENRY FORD HOSPITAL (RETRO),100,,,
HF0953,,,,,35-39,1337,M,ASTROCYTOMA,WHITE,II,HENRY FORD HOSPITAL (RETRO),100,,,
E09858,PR - PARTIAL RESECTION,CRANIOTOMY OPEN RESECTION,PR - PARTIAL RESECTION,CRANIOTOMY OPEN RESECTION,55-59,3886,F,OLIGODENDROGLIOMA,WHITE,,NIH NEURO-ONCOLOGY BRANCH,90,15,100,25
900_00_5549,,,,,,180,,ASTROCYTOMA,,III,TJU,,,,
E09535,PR - PARTIAL RESECTION,CRANIOTOMY OPEN RESECTION,PR - PARTIAL RESECTION,CRANIOTOMY OPEN RESECTION,40-44,600,F,GBM,WHITE,IV,NIH NEURO-ONCOLOGY BRANCH,50,1,,
E09664,PR - PARTIAL RESECTION,CRANIOTOMY OPEN RESECTION,BX - BIOPSY ONLY,CRANIOTOMY OPEN BIOPSY,40-44,812,M,OLIGODENDROGLIOMA,WHITE,,UCSF,,9,,
E10488,PR - PARTIAL RESECTION,CRANIOTOMY OPEN BIOPSY,BX - BIOPSY ONLY,STEREOTACTIC BIOPSY,55-59,656,F,GBM,WHITE,IV,NIH NEURO-ONCOLOGY BRANCH,80,4,,
HF0491,,,,,30-34,,O,ASTROCYTOMA,,II,HENRY FORD HOSPITAL (RETRO),,,,
E09515,,,PR - PARTIAL RESECTION,CRANIOTOMY OPEN RESECTION,35-39,1963,M,ASTROCYTOMA,WHITE,,NIH NEURO-ONCOLOGY BRANCH,100,33,100,
HF0627,,,,,45-49,321,M,GBM,,IV,HENRY FORD HOSPITAL (RETRO),,,,
E09941,,,PR - PARTIAL RESECTION,CRANIOTOMY OPEN RESECTION,60-64,2442,M,OLIGODENDROGLIOMA,WHITE,,NABTT/HENRY FORD HOSPITAL,,,,
E09744,,,,,55-59,1405,F,GBM,WHITE,IV,NABTT/JOHNS HOPKINS,80,7,80,12
3514945,,,,,,,,,,,TJU,,,,
NT2,,,,,,,,NON_TUMOR,UNKNOWN,,NIH NEURO-ONCOLOGY BRANCH,,,,
E10442,BX - BIOPSY ONLY,STEREOTACTIC BIOPSY,PR - PARTIAL RESECTION,CRANIOTOMY OPEN BIOPSY,20-24,,M,,WHITE,,NIH NEURO-ONCOLOGY BRANCH,100,5,70,
E09655,,,,,50-54,,M,GBM,WHITE,IV,H. LEE MOFFITT CANCER CENTER,,,,
E10013,BX - BIOPSY ONLY,CRANIOTOMY OPEN BIOPSY,UNKNOWN,STEREOTACTIC BIOPSY,60-64,148,F,GBM,WHITE,,NIH NEURO-ONCOLOGY BRANCH,,,,
HF0152,,,,,30-34,3946,O,ASTROCYTOMA,,III,HENRY FORD HOSPITAL (RETRO),,,,
HF0024,,,,,75-79,173,F,GBM,,IV,HENRY FORD HOSPITAL (RETRO),,,,
E09408,,,CR - COMPLETE RESECTION,CRANIOTOMY OPEN RESECTION,30-34,,F,ASTROCYTOMA,WHITE,III,UNIVERSITY OF WISCONSIN,100,6,100,14
HF0017,,,,,45-49,3996,M,ASTROCYTOMA,,III,HENRY FORD HOSPITAL (RETRO),,,,
HF0050,,,,,50-54,787,F,GBM,,IV,HENRY FORD HOSPITAL (RETRO),,,,
E10227,,,BX - BIOPSY ONLY,CRANIOTOMY OPEN BIOPSY,50-54,379,F,GBM,WHITE,,NABTT/HENRY FORD HOSPITAL,90,6,60,11
900_00_5406,,,,,,360,,GBM,,,TJU,,,,
E10036,,,CR - COMPLETE RESECTION,CRANIOTOMY OPEN RESECTION,55-59,949,M,UNKNOWN,WHITE,,NABTT/HENRY FORD HOSPITAL,,6,,12
E09139,PR - PARTIAL RESECTION,CRANIOTOMY OPEN RESECTION,CR - COMPLETE RESECTION,CRANIOTOMY OPEN RESECTION,50-54,1095,F,GBM,WHITE,,NIH NEURO-ONCOLOGY BRANCH,80,,,
E09988,,,CR - COMPLETE RESECTION,CRANIOTOMY OPEN RESECTION,20-24,1939,M,OLIGODENDROGLIOMA,WHITE,III,NABTT/H. LEE MOFFITT CANCER CENTER,50,6,40,9
E09774,,,,,50-54,237,M,UNKNOWN,WHITE,,NABTT/JOHNS HOPKINS,40,6,,
HF0899,,,,,55-59,2001,M,ASTROCYTOMA,WHITE,II,HENRY FORD HOSPITAL (RETRO),,,,
3512529,,,,,,,,,,,TJU,,,,
E09932,PR - PARTIAL RESECTION,CRANIOTOMY OPEN RESECTION,BX - BIOPSY ONLY,CRANIOTOMY OPEN BIOPSY,25-29,1042,F,MIXED,WHITE,,NIH NEURO-ONCOLOGY BRANCH,,,,
E10211,,,CR - COMPLETE RESECTION,CRANIOTOMY OPEN RESECTION,40-44,852,M,GBM,WHITE,,UCSF,,4,,
E10264,,,BX - BIOPSY ONLY,STEREOTACTIC BIOPSY,60-64,,M,GBM,WHITE,,NABTT/HENRY FORD HOSPITAL,80,7,,
E09622,,,,,65-69,,M,GBM,WHITE,IV,NABTT/H. LEE MOFFITT CANCER CENTER,80,6,70,11
900_00_5552,,,,,,210,,OLIGODENDROGLIOMA,,,TJU,,,,
900_00_5476,,,,,,270,,OLIGODENDROGLIOMA,,II,TJU,,,,
HF0606,,,,,30-34,2303,O,ASTROCYTOMA,,II,HENRY FORD HOSPITAL (RETRO),,,,
E10001,CR - COMPLETE RESECTION,CRANIOTOMY OPEN RESECTION,CR - COMPLETE RESECTION,CRANIOTOMY OPEN RESECTION,25-29,261,M,OLIGODENDROGLIOMA,WHITE,III,UCLA SCHOOL OF MEDICINE,60,5,,
E10520,,,PR - PARTIAL RESECTION,CRANIOTOMY OPEN RESECTION,55-59,,F,,WHITE,,NIH NEURO-ONCOLOGY BRANCH,100,,,
HF1297,,,,,60-64,515,F,GBM,WHITE,IV,HENRY FORD HOSPITAL (RETRO),80,,,
900_00_5342,,,,,,450,,GBM,,,TJU,,,,
HF1269,,,,,45-49,390,M,GBM,WHITE,IV,HENRY FORD HOSPITAL (RETRO),80,,,
E09449,,,,,50-54,,M,GBM,OTHER,IV,NIH NEURO-ONCOLOGY BRANCH,90,6,,12
E09964,,,BX - BIOPSY ONLY,CRANIOTOMY OPEN BIOPSY,55-59,989,M,UNKNOWN,WHITE,,NABTT/H. LEE MOFFITT CANCER CENTER,70,6,70,12
E09654,,,,,65-69,218,F,GBM,WHITE,IV,NABTT/H. LEE MOFFITT CANCER CENTER,40,5,,
E10161,PR - PARTIAL RESECTION,CRANIOTOMY OPEN RESECTION,PR - PARTIAL RESECTION,CRANIOTOMY OPEN RESECTION,40-44,617,M,GBM,WHITE,,NIH NEURO-ONCOLOGY BRANCH,100,4,,
MD602958,CR - COMPLETE RESECTION,CRANIOTOMY OPEN RESECTION,BX - BIOPSY ONLY,STEREOTACTIC BIOPSY,60-64,545,M,GBM,WHITE,IV,M. D. ANDERSON CANCER CENTER,90,7,30,12
HF0954.2,,,,,70-74,329,O,ASTROCYTOMA,,III,HENRY FORD HOSPITAL (RETRO),,,,
E09982,,,,,70-74,,F,UNKNOWN,WHITE,,NABTT/H. LEE MOFFITT CANCER CENTER,100,6,90,12
E10260,,,,,30-34,3269,M,,WHITE,,NIH NEURO-ONCOLOGY BRANCH,50,6,,
HF0652.4,,,,,50-54,587,M,GBM,,IV,HENRY FORD HOSPITAL (RETRO),,,,
HF1262,,,,,55-59,712,O,GBM,,IV,HENRY FORD HOSPITAL (RETRO),,,,
E10136,,,,,,,,,,,HENRY FORD HOSPITAL,,,,
HF1489,,,,,50-54,2049,F,ASTROCYTOMA,WHITE,II,HENRY FORD HOSPITAL (RETRO),100,,,
E09546,,,CR - COMPLETE RESECTION,CRANIOTOMY OPEN RESECTION,60-64,,M,UNKNOWN,WHITE,,UCSF,60,4,70,15
E10110,,,CR - COMPLETE RESECTION,CRANIOTOMY OPEN RESECTION,40-44,692,M,GBM,WHITE,,NIH NEURO-ONCOLOGY BRANCH,80,2,,
HF0992,,,,,75-79,599,O,GBM,,IV,HENRY FORD HOSPITAL (RETRO),,,,
HF1433,,,,,45-49,2346,F,OLIGODENDROGLIOMA,WHITE,II,HENRY FORD HOSPITAL (RETRO),,,,
HF1511,,,,,25-29,1698,M,ASTROCYTOMA,OTHER,II,HENRY FORD HOSPITAL (RETRO),100,,,
HF1517,,,,,55-59,249,F,GBM,WHITE,IV,HENRY FORD HOSPITAL (RETRO),100,,,
E10019,,,,,55-59,,M,UNKNOWN,WHITE,,NABTT/H. LEE MOFFITT CANCER CENTER,,,,
E09931,,,PR - PARTIAL RESECTION,CRANIOTOMY OPEN RESECTION,40-44,467,F,GBM,WHITE,,NIH NEURO-ONCOLOGY BRANCH,90,4,,
E09398,,,,,25-29,,M,ASTROCYTOMA,WHITE,II,UCSF,,6,,11
HF1318,,,,,50-54,231,M,GBM,WHITE,IV,HENRY FORD HOSPITAL (RETRO),,,,
900_00_5540,,,,,,240,,GBM,,,TJU,,,,
E09708,,,,,65-69,,F,UNKNOWN,WHITE,,NABTT/H. LEE MOFFITT CANCER CENTER,,,,
E09860,,,CR - COMPLETE RESECTION,CRANIOTOMY OPEN RESECTION,35-39,1105,F,OLIGODENDROGLIOMA,WHITE,II,UCLA SCHOOL OF MEDICINE,100,6,100,12
HF1606,,,,,60-64,2209,M,ASTROCYTOMA,WHITE,II,HENRY FORD HOSPITAL (RETRO),90,,,
HF1087,,,,,60-64,73,O,GBM,,IV,HENRY FORD HOSPITAL (RETRO),,,,
E10313,,,,,55-59,588,M,GBM,WHITE,,UNIV OF PITTSBURGH,,13,90,
E10312,,,PR - PARTIAL RESECTION,CRANIOTOMY OPEN RESECTION,35-39,1138,M,GBM,WHITE,,NIH NEURO-ONCOLOGY BRANCH,70,6,70,7
E10267,,,BX - BIOPSY ONLY,STEREOTACTIC BIOPSY,30-34,360,F,GBM,WHITE,,NABTT/HENRY FORD HOSPITAL,70,6,60,8
E10059,CR - COMPLETE RESECTION,CRANIOTOMY OPEN RESECTION,CR - COMPLETE RESECTION,STEREOTACTIC BIOPSY,50-54,,M,UNKNOWN,WHITE,,NABTT/MASSACHUSETTS GENERAL HOSPITAL,90,6,90,12
E09819,,,PR - PARTIAL RESECTION,CRANIOTOMY OPEN RESECTION,60-64,326,M,ASTROCYTOMA,ASIAN,,NIH NEURO-ONCOLOGY BRANCH,60,6,,
HF1090,,,,,60-64,255,O,OLIGODENDROGLIOMA,,III,HENRY FORD HOSPITAL (RETRO),,,,
HF1137,,,,,70-74,549,F,GBM,WHITE,IV,HENRY FORD HOSPITAL (RETRO),80,,,
E10578,,,,,35-39,,F,,WHITE,,NIH NEURO-ONCOLOGY BRANCH,100,3,,
E09868,,,CR - COMPLETE RESECTION,CRANIOTOMY OPEN RESECTION,50-54,588,F,UNKNOWN,WHITE,,UNIVERSITY OF WISCONSIN,80,7,,
HF0749,,,,,15-19,,O,OLIGODENDROGLIOMA,,II,HENRY FORD HOSPITAL (RETRO),,,,
E09661,,,PR - PARTIAL RESECTION,CRANIOTOMY OPEN RESECTION,35-39,1454,M,OLIGODENDROGLIOMA,WHITE,II,UCSF,,17,0,
HF1357,,,,,20-24,924,M,OLIGODENDROGLIOMA,WHITE,III,HENRY FORD HOSPITAL (RETRO),,,,
E09289,PR - PARTIAL RESECTION,CRANIOTOMY OPEN RESECTION,PR - PARTIAL RESECTION,CRANIOTOMY OPEN RESECTION,30-34,851,F,MIXED,OTHER,,NIH NEURO-ONCOLOGY BRANCH,100,9,100,16
MD608660,,,PR - PARTIAL RESECTION,CRANIOTOMY OPEN RESECTION,70-74,110,F,GBM,WHITE,IV,M. D. ANDERSON CANCER CENTER,,,,
900_0053_03,,,,,,150,,GBM,,,TJU,,,,
E09348,,,PR - PARTIAL RESECTION,CRANIOTOMY OPEN RESECTION,60-64,555,M,GBM,WHITE,,NIH NEURO-ONCOLOGY BRANCH,100,3,,
E10058,,,,,70-74,,F,UNKNOWN,WHITE,,NABTT/H. LEE MOFFITT CANCER CENTER,60,6,70,12
900_00_5445,,,,,,60,,GBM,,,TJU,,,,
900_00_5382,,,,,,480,,ASTROCYTOMA,,II,TJU,,,,
E10008,,,CR - COMPLETE RESECTION,CRANIOTOMY OPEN RESECTION,40-44,2162,M,UNKNOWN,WHITE,,NABTT/HENRY FORD HOSPITAL,90,6,90,12
HF1227,,,,,25-29,7552,F,OLIGODENDROGLIOMA,WHITE,II,HENRY FORD HOSPITAL (RETRO),100,,,
HF0151,,,,,45-49,3944,O,NON_TUMOR,,,HENRY FORD HOSPITAL (RETRO),,,,
E09965,PR - PARTIAL RESECTION,CRANIOTOMY OPEN RESECTION,PR - PARTIAL RESECTION,CRANIOTOMY OPEN RESECTION,40-44,555,M,UNKNOWN,BLACK,,NABTT/H. LEE MOFFITT CANCER CENTER,80,6,,
E09937,,,,,50-54,,M,OLIGODENDROGLIOMA,WHITE,II,NABTT/H. LEE MOFFITT CANCER CENTER,90,6,,
HF1058,,,,,50-54,541,F,GBM,WHITE,IV,HENRY FORD HOSPITAL (RETRO),,,,
HF0453,,,,,75-79,3158,F,OLIGODENDROGLIOMA,,II,HENRY FORD HOSPITAL (RETRO),,,,
E09430,CR - COMPLETE RESECTION,CRANIOTOMY OPEN RESECTION,PR - PARTIAL RESECTION,CRANIOTOMY OPEN RESECTION,50-54,961,F,GBM,WHITE,,NIH NEURO-ONCOLOGY BRANCH,100,1,100,5
E09704,,,BX - BIOPSY ONLY,STEREOTACTIC BIOPSY,50-54,336,M,UNKNOWN,WHITE,,DANA-FARBER CANCER INSTITUTE,,,,
E09483,,,CR - COMPLETE RESECTION,CRANIOTOMY OPEN RESECTION,45-49,310,F,GBM,WHITE,IV,UCSF,70,5,,
HF1551,,,,,30-34,2127,F,ASTROCYTOMA,WHITE,II,HENRY FORD HOSPITAL (RETRO),80,,,
E10248,,,,,25-29,,M,ASTROCYTOMA,WHITE,,NABTT/HENRY FORD HOSPITAL,90,6,90,12
E10494,PR - PARTIAL RESECTION,CRANIOTOMY OPEN RESECTION,PR - PARTIAL RESECTION,CRANIOTOMY OPEN RESECTION,50-54,,M,,WHITE,,NIH NEURO-ONCOLOGY BRANCH,,,,