Subject ID,MEDIAN_INTENSITY_UNNORMALIZED,PCT_ARRAY_OUTLIER,PCT_SINGLE_OUTLIER,WARNING,LABORATORY_BATCH,Histologic grade,Cancer Follow-Up Status Date,MONTHS_TO_LAST_CONTACT_OR_DEATH,Patient Last Contact Date,DEATH_DATE,Smoking History Ind,Surgical Margins Resection Code,American Joint Committee on Cancer Lung N Stage Code,American Joint Committee on Cancer Lung T Stage Code,Systemic Adjuvant Chemotherapy Indicator,Patient Race Category,VITAL_STATUS,Adjuvant Radiation Therapy Administered Ind-3,ENROLLMENT_DATE,FIRST_PROGRESSION_OR_RELAPSE,MTHS_TO_LAST_CLINICAL_ASSESSMENT,MONTHS_TO_FIRST_PROGRESSION,PATIENT_ID,MICROARRAY,DC_STUDY_ID,IN_DC_STUDY,SITE,Diagnosis Age,Patient Gender Category
313,193,2.275,0.269,,2,POORLY DIFFERENTIATED,9/20/2003,95,2/17/2004,2/17/2004,Smoked in the past,R0,N1,T1,Yes,Unknown,Dead,No,4/29/1996,Yes,90,77,,CL2004111033AA,D070B,1,DFCI,70,FEMALE
167,193,1.921,0.14,,,POORLY DIFFERENTIATED,3/7/1998,26,3/7/1998,3/7/1998,Smoked in the past,R0,N2,T2,Yes,White,Dead,Yes,1/17/1996,Yes,26,10,,NCI_U133A_17L,B-NCI_U133A_17L.CHP,1,MSKCC,64,MALE
191,191,0.642,0.06,,,Moderate Differentiation,1/14/2001,60,1/14/2001,,Smoked in the past,R0,N0,T1,No,White,Alive,No,2/10/1996,No,60,,,NCI_U133A_41L,B-NCI_U133A_41L.CHP,1,MSKCC,57,FEMALE
380,193,0.749,0.133,,4,Moderate Differentiation,12/27/1997,18,12/27/1997,12/27/1997,Never smoked,R0,N1,T2,Unknown,Not Reported,Dead,Unknown,7/5/1996,Yes,18,17,,CL20041119191AA,D269,1,DFCI,79,MALE
700_Stratagene_reference18,,,,,,,,,,,,,,,,,,,,,,,,NCI_control9_U133A,,1,MI,,
58,192,2.28,0.552,,17,POORLY DIFFERENTIATED,6/9/2007,130.8,6/9/2007,,,R0,N0,T1,No,White,Alive,No,9/10/1996,No,130.8,,,NCI_Lung_59_U133A,A59,1,MI,57,FEMALE
90,192,2.706,0.318,,19,POORLY DIFFERENTIATED,5/13/2001,55.8,5/13/2001,,Smoked in the past,R0,N0,T1,No,White,Alive,No,10/12/1996,No,55.8,,,NCI_Lung_92_U133A,A92,1,MI,78,MALE
523,192,2.576,0.26,,11,,2/22/1997,,2/22/1997,2/22/1997,Currently smoking,R0,N2,T2,Yes,White,Dead,Yes,2/22/1997,Unknown,,,,Moff 3265E,C3265E,0,HLM,67,MALE
68,192,4.088,0.435,,17,POORLY DIFFERENTIATED,7/12/2010,168.1,7/12/2010,,Smoked in the past,R0,N0,T1,No,Asian,Alive,No,9/20/1996,No,168.1,,,NCI_Lung_69_U133A,A69,1,MI,46,MALE
324,193,1.535,0.129,,3,POORLY DIFFERENTIATED,5/4/2003,85,5/4/2003,,Never smoked,R0,N0,T2,Yes,Unknown,Alive,No,5/10/1996,No,85,,,CL20041116126AA,D200,1,DFCI,66,FEMALE
239,192,1.05,0.108,,,POORLY DIFFERENTIATED,5/13/1999,38,5/13/1999,,Never smoked,R0,N2,T2,No,White,Alive,No,3/29/1996,No,38,,,NCI_U133A_89L,B-NCI_U133A_89L.CHP,1,MSKCC,38,FEMALE
49,191,1.36,0.24,,16,Moderate Differentiation,4/30/2006,117.6,4/30/2006,,Never smoked,R0,N0,T2,Yes,White,Alive,Yes,9/1/1996,No,117.6,,,NCI_Lung50_U133A,A50,1,MI,73,FEMALE
63,192,4.245,0.915,,17,Moderate Differentiation,1/8/1999,28.2,1/9/1999,1/9/1999,Smoked in the past,R0,N2,T2,No,Not Reported,Dead,No,9/15/1996,No,28.17,,,NCI_Lung_64_U133A,A64,1,MI,64,MALE
160,192,1.113,0.11,,,Moderate Differentiation,8/1/2003,92,8/1/2003,,Currently smoking,R0,N0,T1,No,White,Alive,No,1/10/1996,Yes,92,37,,NCI_U133A_10L,B-NCI_U133A_10L.CHP,1,MSKCC,65,MALE
257,192,1.728,0.122,,,Moderate Differentiation,7/19/2001,64,7/19/2001,,Never smoked,R0,N0,T1,No,White,Alive,No,4/16/1996,No,64,,,NCI_U133A_97L,B-NCI_U133A_97L.CHP,1,MSKCC,74,MALE
26,193,2.545,0.285,,14,POORLY DIFFERENTIATED,11/20/1997,17.6,1/19/1998,1/19/1998,Smoked in the past,R0,N2,T2,Yes,White,Dead,Yes,8/9/1996,Yes,15.6,9,,NCI_Lung_27_U133A,A27,1,MI,58,MALE
533,192,4.38,0.228,,11,POORLY DIFFERENTIATED,4/22/1998,15.77,6/20/1998,6/20/1998,Currently smoking,R0,N0,T2,No,White,Dead,No,3/4/1997,Yes,13.83,13.14,,Moff 4112G,C4112G,1,HLM,73,MALE
700_Stratagene_reference1,,,,,,,,,,,,,,,,,,,,,,,,Moff Strat1,,1,HLM,,
95,192,2.087,0.18,,19,Moderate Differentiation,10/15/2001,60.8,10/15/2001,,Smoked in the past,R0,N0,T1,No,White,Alive,No,10/17/1996,No,60.8,,,NCI_Lung_97_U133A,A97,1,MI,72,MALE
359,193,4.717,0.298,,2,POORLY DIFFERENTIATED,11/1/1998,29,11/1/1998,11/1/1998,Currently smoking,R0,N1,T2,Unknown,Not Reported,Dead,Unknown,6/14/1996,Yes,29,17,,CL20041110102AA,D171,1,DFCI,63,FEMALE
364,193,3.141,0.444,,2,POORLY DIFFERENTIATED,7/23/2001,62,7/23/2001,,Currently smoking,R0,N0,T2,Unknown,Not Reported,Alive,Unknown,6/19/1996,,62,,,CL20041110109AA,D181,1,DFCI,40,FEMALE
307,192,2.361,0.337,,6,POORLY DIFFERENTIATED,8/6/1999,40,8/6/1999,,Smoked in the past,R0,N1,T1,No,White,Alive,No,4/23/1996,Yes,40,11,,CL2005060345AA,D130,1,DFCI,43,MALE
611,192,2.118,0.122,,24,POORLY DIFFERENTIATED,3/24/2009,145.8,3/25/2009,,Unknown,R0,N0,T3,Unknown,Unknown,Alive,Unknown,4/3/1997,,145.77,,,NCI_lung288 _U133,A288,1,MI,59,MALE
188,193,0.494,0.052,,,POORLY DIFFERENTIATED,2/21/1999,100,4/25/2004,,Never smoked,R0,N1,T2,Yes,White,Alive,No,2/7/1996,Yes,37,19,,NCI_U133A_38L,B-NCI_U133A_38L.CHP,1,MSKCC,59,FEMALE
200,192,1.584,0.092,,,POORLY DIFFERENTIATED,10/1/1999,48,1/29/2000,1/29/2000,Smoked in the past,R0,N0,T1,Yes,White,Dead,No,2/19/1996,No,44,,,NCI_U133A_50L,B-NCI_U133A_50L.CHP,1,MSKCC,61,FEMALE
59,192,2.859,0.632,,17,Moderate Differentiation,10/21/2009,159.6,10/21/2009,,Smoked in the past,R0,N0,T1,No,Black or African American,Alive,No,9/11/1996,No,159.6,,,NCI_Lung_60_U133A,A60,1,MI,59,FEMALE
143,192,2.764,0.285,,23,POORLY DIFFERENTIATED,12/23/1998,24.97,12/23/1998,12/23/1998,Unknown,R0,N1,T3,Unknown,White,Dead,Unknown,12/4/1996,,24.97,,,NCI_lung267_U133A,A267,1,MI,59,MALE
214,192,2.85,0.35,,,POORLY DIFFERENTIATED,6/11/2000,52,6/11/2000,6/11/2000,Never smoked,R0,N0,T2,Yes,White,Dead,Yes,3/4/1996,Yes,52,19,,NCI_U133A_64L,B-NCI_U133A_64L.CHP,1,MSKCC,61,FEMALE
453,192,2.598,0.271,,7,,10/27/1998,22.74,10/27/1998,10/27/1998,Smoked in the past,,,,No,White,Dead,No,12/14/1996,No,22.74,,,Moff 0272C,C0272C,0,HLM,72,MALE
541,192,2.746,0.152,,8,POORLY DIFFERENTIATED,7/14/1997,4.14,7/14/1997,7/14/1997,Smoked in the past,R0,N2,T1,No,White,Dead,No,3/12/1997,Yes,4.14,3.48,,Moff 0344B,C344B,0,HLM,69,FEMALE
187,192,1.53,0.089,,,POORLY DIFFERENTIATED,1/31/1997,14,4/1/1997,4/1/1997,Currently smoking,R0,N0,T2,No,White,Dead,No,2/6/1996,No,12,,,NCI_U133A_37L_Rep,B-NCI_U133A_37L_Rep,1,MSKCC,74,FEMALE
32,192,3.649,0.3,,15,POORLY DIFFERENTIATED,12/12/1996,4,12/13/1996,12/13/1996,Smoked in the past,R0,N0,T3,No,White,Dead,No,8/15/1996,Yes,3.97,3,,NCI_Lung33_U133A,A33,1,MI,45,FEMALE
100,192,2.087,0.241,,20,Moderate Differentiation,8/30/2001,59.11,8/30/2001,8/30/2001,Unknown,R0,N0,T2,Unknown,White,Dead,Unknown,10/22/1996,,59.11,,,NCI_lung202_U133A,A202,1,MI,70,MALE
205,192,1.077,0.063,,,POORLY DIFFERENTIATED,9/20/2002,80,9/20/2002,,Smoked in the past,R0,N0,T1,No,White,Alive,No,2/24/1996,No,80,,,NCI_U133A_55L,B-NCI_U133A_55L.CHP,1,MSKCC,54,MALE
369,192,2.441,0.194,,3,Moderate Differentiation,10/7/1999,40,10/7/1999,,Smoked in the past,R0,N0,T2,Unknown,Not Reported,Alive,Unknown,6/24/1996,,40,,,CL20041116114AA,D186,1,DFCI,62,MALE
500,193,1.149,0.128,,7,Moderate Differentiation,7/13/2000,42.02,7/13/2000,7/13/2000,Smoked in the past,R0,N1,T4,Unknown,White,Dead,Unknown,1/30/1997,No,42.02,,,Moff 2497D,C2497D,1,HLM,79,MALE
250,193,2.087,0.124,,,Moderate Differentiation,12/14/2000,57,12/14/2000,,Smoked in the past,R0,N1,T2,Yes,White,Alive,No,4/9/1996,Yes,57,31,,NCI_U133A_101L,B-NCI_U133A_101L.CH,1,MSKCC,58,FEMALE
506,193,2.554,0.146,,7,Moderate Differentiation,1/27/1999,24.51,2/10/1999,2/10/1999,Smoked in the past,R0,N0,T2,No,White,Dead,No,2/5/1997,Yes,24.05,22.18,,Moff 2634G,C2634G,1,HLM,63,FEMALE
108,192,2.428,0.342,,20,Moderate Differentiation,8/5/1998,21.48,8/5/1998,8/5/1998,Unknown,R0,N0,T1,Unknown,White,Dead,Unknown,10/30/1996,Yes,21.48,19.5,,NCI_lung210_U133A,A210,1,MI,63,MALE
148,192,2.114,0.25,,23,Moderate Differentiation,5/14/2002,66.1,5/15/2002,5/15/2002,Unknown,R0,N0,T4,Unknown,Unknown,Dead,Unknown,12/9/1996,,66.07,,,NCI_lung272_U133A,A272,1,MI,67,MALE
540,192,2.033,0.133,,8,Moderate Differentiation,3/23/1999,24.74,3/23/1999,3/23/1999,Smoked in the past,R0,N1,T2,Yes,White,Dead,Yes,3/11/1997,Yes,24.74,20.57,,Moff 0298B,C298B,1,HLM,71,FEMALE
256,193,6.943,0.407,*,,POORLY DIFFERENTIATED,12/1/1998,32,12/1/1998,,Smoked in the past,R0,N1,T2,No,White,Alive,No,4/15/1996,No,32,,,NCI_U133A_107L,B-NCI_U133A_107L.CH,1,MSKCC,75,FEMALE
13,193,2.594,0.583,,13,POORLY DIFFERENTIATED,7/27/1996,34.8,6/6/1999,6/6/1999,Smoked in the past,R0,N0,T1,No,White,Dead,No,7/27/1996,Yes,,25,,NCI_Lung_14_U133A,A14,1,MI,62,FEMALE
67,192,2.037,0.263,,17,Moderate Differentiation,1/11/2005,101.2,1/11/2005,,Smoked in the past,R0,N0,T2,No,White,Alive,No,9/19/1996,No,101.2,,,NCI_Lung_68_U133A,A68,1,MI,60,MALE
614,193,1.382,0.281,,24,Moderate Differentiation,11/12/1998,19.5,11/12/1998,11/12/1998,Unknown,R0,N0,T1,Unknown,Unknown,Dead,Unknown,4/6/1997,Yes,19.5,,,NCI_lung291_U133,A291,1,MI,77,MALE
99,192,1.858,0.194,,20,POORLY DIFFERENTIATED,9/8/2000,47.27,9/8/2000,,Unknown,R0,N0,T2,Unknown,White,Alive,Unknown,10/21/1996,,47.27,,,NCI_lung201_U133A,A201,1,MI,76,FEMALE
507,192,2.428,0.335,,10,Moderate Differentiation,2/27/1997,7.03,9/4/1997,9/4/1997,Smoked in the past,R0,N0,T2,No,White,Dead,No,2/6/1997,No,0.72,,,Moff 2658C,C2658C,1,HLM,81,FEMALE
50,192,2.993,0.179,,16,Moderate Differentiation,3/8/2006,115.8,3/8/2006,3/8/2006,Smoked in the past,R0,N1,T2,Yes,White,Dead,Yes,9/2/1996,Yes,115.8,34,,NCI_Lung51_U133A,A51,1,MI,52,FEMALE
624,192,4.106,0.221,,25,Moderate Differentiation,8/2/2001,52.3,8/2/2001,,Unknown,R0,N1,T1,Unknown,Unknown,Alive,Unknown,4/16/1997,,52.3,,,NCI_Lung304_U133,A304,1,MI,46,FEMALE
631,192,2.571,0.156,,25,POORLY DIFFERENTIATED,1/23/1998,9.2,1/24/1998,1/24/1998,Unknown,R0,N0,T1,Unknown,Unknown,Dead,Unknown,4/23/1997,,9.17,,,NCI_Lung312_U133,A312,1,MI,68,MALE
615,192,2.558,0.22,,24,POORLY DIFFERENTIATED,12/15/1997,8.4,12/15/1997,12/15/1997,Unknown,R0,N1,T2,Unknown,Unknown,Dead,Unknown,4/7/1997,Yes,8.4,,,NCI_lung292_U133,A292,1,MI,70,MALE
618,192,1.369,0.248,,24,POORLY DIFFERENTIATED,11/19/1998,19.6,11/19/1998,11/19/1998,Unknown,R0,N1,T3,Unknown,Unknown,Dead,Unknown,4/10/1997,,19.6,,,NCI_lung295_U133,A295,1,MI,66,MALE
18,191,1.221,0.191,,13,POORLY DIFFERENTIATED,8/1/1996,8.7,4/19/1997,4/19/1997,Smoked in the past,R0,N0,T2,Yes,White,Dead,Yes,8/1/1996,Yes,,1,,NCI_Lung_19_U133A,A19,1,MI,48,FEMALE
35,191,1.418,0.175,,15,POORLY DIFFERENTIATED,9/30/2001,62.3,9/30/2001,9/30/2001,Smoked in the past,R0,N0,T2,Yes,White,Dead,Yes,8/18/1996,No,62.3,,,NCI_Lung36_U133A,A36,1,MI,61,MALE
65,193,2.778,0.469,,17,Moderate Differentiation,3/29/2003,79.5,3/30/2003,3/30/2003,Smoked in the past,R0,N0,T1,No,White,Dead,No,9/17/1996,Yes,79.47,,,NCI_Lung_66_U133A,A66,1,MI,67,MALE
103,192,1.607,0.285,,20,Moderate Differentiation,5/11/1997,6.6,5/11/1997,5/11/1997,Unknown,R1,N0,T3,Unknown,White,Dead,Unknown,10/25/1996,,6.6,,,NCI_lung205_U133A,A205,1,MI,82,MALE
622,192,1.741,0.169,,25,WELL DIFFERENTIATED,3/18/2001,47.8,3/18/2001,3/18/2001,Unknown,R0,N0,T2,Unknown,Unknown,Dead,Unknown,4/14/1997,Yes,47.8,,,NCI_Lung299_U133,A299,1,MI,66,MALE
549,192,1.472,0.217,,9,POORLY DIFFERENTIATED,11/18/2001,57.33,12/3/2001,12/3/2001,Smoked in the past,R0,N2,T2,Yes,White,Dead,No,3/20/1997,Yes,56.83,38.54,,Moff 1123B,C1123B,0,HLM,55,MALE
623,192,2.612,0.228,,25,POORLY DIFFERENTIATED,12/18/2007,130,12/19/2007,12/19/2007,Unknown,R0,N1,T2,Unknown,Unknown,Dead,Unknown,4/15/1997,,129.97,,,NCI_Lung300_U133,A300,1,MI,65,MALE
329,193,8.033,0.972,*,6,POORLY DIFFERENTIATED,5/3/2004,97,5/3/2004,,Smoked in the past,R0,N0,T2,Yes,Unknown,Alive,No,5/15/1996,No,97,,,CL2005060339AA,D121,1,DFCI,40,FEMALE
55,192,2.432,0.414,,16,WELL DIFFERENTIATED,1/15/2010,162.6,1/15/2010,,Smoked in the past,R0,N0,T1,No,White,Alive,No,9/7/1996,No,162.6,,,NCI_Lung56_U133A,A56,1,MI,62,FEMALE
96,192,1.629,0.238,,19,WELL DIFFERENTIATED,7/15/1998,21.2,7/16/1998,7/16/1998,Never smoked,R0,N0,T1,No,White,Dead,No,10/18/1996,Yes,21.17,8,,NCI_Lung_98_U133A,A98,1,MI,81,FEMALE
520,192,3.267,0.189,,8,,2/19/1997,,2/19/1997,,,,,,,,,,2/19/1997,,,,,Moff 3105L,C3105L,0,HLM,,UNKNOWN
547,192,2.401,0.267,,9,POORLY DIFFERENTIATED,6/7/1997,3.75,7/8/1997,7/8/1997,Smoked in the past,R0,N2,T2,No,White,Dead,No,3/18/1997,Yes,2.73,1.51,,Moff 0459F,C459F,0,HLM,66,FEMALE
498,192,1.409,0.119,,8,Moderate Differentiation,11/8/2003,82.5,11/8/2003,,Currently smoking,R0,N0,T1,No,White,Alive,No,1/28/1997,No,82.5,,,Moff 2470G,C2470G,1,HLM,66,FEMALE
165,192,0.781,0.063,,,POORLY DIFFERENTIATED,10/6/1997,21,10/6/1997,10/6/1997,Never smoked,R0,N2,T2,No,White,Dead,No,1/15/1996,No,21,,,NCI_U133A_15L,B-NCI_U133A_15L.CHP,1,MSKCC,48,FEMALE
255,193,2.392,0.167,,,POORLY DIFFERENTIATED,10/26/1999,43,10/26/1999,,Never smoked,R0,N0,T2,No,White,Alive,No,4/14/1996,No,43,,,NCI_U133A_106L,B-NCI_U133A_106L.CH,1,MSKCC,67,MALE
634,193,2.993,0.169,,26,POORLY DIFFERENTIATED,4/9/1998,11.6,4/9/1998,4/9/1998,Unknown,R0,N0,T3,Unknown,Unknown,Dead,Unknown,4/26/1997,Yes,11.6,,,NCI_Lung315_U133A,A315,0,MI,80,MALE
33,192,2.441,0.271,,15,POORLY DIFFERENTIATED,1/1/1998,16.8,1/2/1998,1/2/1998,Smoked in the past,R0,N2,T1,Yes,White,Dead,Yes,8/16/1996,No,16.77,,,NCI_Lung34_U133A,A34,1,MI,78,FEMALE
146,192,3.132,0.296,,23,POORLY DIFFERENTIATED,2/26/1997,2.7,2/26/1997,2/26/1997,Unknown,R0,N1,T3,Unknown,Unknown,Dead,Unknown,12/7/1996,Yes,2.7,,,NCI_lung270_U133A,A270,1,MI,74,MALE
486,192,2.509,0.272,,7,POORLY DIFFERENTIATED,10/2/2000,45.24,10/4/2000,10/4/2000,Smoked in the past,R0,N0,T2,Yes,White,Dead,No,1/16/1997,Yes,45.17,17.77,,Moff 2219F,C2219F,1,HLM,70,MALE
700_Stratagene_reference17,,,,,,,,,,,,,,,,,,,,,,,,NCI_control8_U133A,,1,MI,,
509,193,1.665,0.172,,7,WELL DIFFERENTIATED,1/28/2000,40.21,5/29/2000,5/29/2000,Never smoked,R0,N0,T2,No,White,Dead,No,2/8/1997,No,36.14,,,Moff 2690H,C2690H,1,HLM,60,FEMALE
457,192,3.949,0.182,,10,Moderate Differentiation,1/6/2000,37.55,1/18/2000,1/18/2000,Smoked in the past,R0,N2,T2,No,White,Dead,No,12/18/1996,Yes,37.16,27.14,,Moff 0604H,C0604H,1,HLM,74,FEMALE
617,192,2.455,0.215,,24,POORLY DIFFERENTIATED,12/7/2007,129.8,12/7/2007,,Unknown,R0,N0,T2,Unknown,Unknown,Alive,Unknown,4/9/1997,,129.8,,,NCI_lung294_U133,A294,1,MI,67,MALE
128,192,4.326,0.915,,22,POORLY DIFFERENTIATED,4/13/2003,77.89,4/13/2003,,Unknown,R0,N0,T2,Unknown,White,Alive,Unknown,11/19/1996,,77.89,,,NCI_lung236_U133A,A236,1,MI,64,FEMALE
505,192,2.89,0.159,,7,Moderate Differentiation,10/17/2003,81.54,10/17/2003,,Smoked in the past,R0,N0,T2,No,White,Alive,No,2/4/1997,No,81.54,,,Moff 2629F,C2629F,1,HLM,75,MALE
230,192,1.503,0.141,,,POORLY DIFFERENTIATED,3/10/1998,24,3/10/1998,3/10/1998,Smoked in the past,R0,N0,T1,No,White,Dead,No,3/20/1996,No,24,,,NCI_U133A_80L,B-NCI_U133A_80L.CHP,1,MSKCC,51,FEMALE
375,192,0.857,0.101,,4,Moderate Differentiation,2/15/1999,32,2/15/1999,,Never smoked,R0,N0,T2,Unknown,Not Reported,Alive,Unknown,6/30/1996,,32,,,CL20041119184AA,D259,1,DFCI,70,FEMALE
632,192,2.953,0.317,,25,POORLY DIFFERENTIATED,11/15/1998,19,11/15/1998,11/15/1998,Unknown,R0,N0,T2,Unknown,Unknown,Dead,Unknown,4/24/1997,,19,,,NCI_Lung313_U133,A313,1,MI,66,MALE
311,192,1.485,0.181,,1,POORLY DIFFERENTIATED,5/10/2005,110,5/10/2005,,Smoked in the past,R0,N0,T2,No,Unknown,Alive,No,4/27/1996,No,110,,,CL2004110909AA,D024B,1,DFCI,55,FEMALE
243,193,2.643,0.148,,,Moderate Differentiation,3/18/1999,36,3/18/1999,,Never smoked,R0,N0,T2,No,White,Alive,No,4/2/1996,No,36,,,NCI_U133A_93L,B-NCI_U133A_93L.CHP,1,MSKCC,54,FEMALE
461,192,2.859,0.256,,11,,7/1/1999,30.72,7/1/1999,7/1/1999,Smoked in the past,,,,No,White,Dead,Yes,12/22/1996,Yes,30.72,22.77,,Moff 0757N,C0757N,0,HLM,74,MALE
193,192,0.66,0.069,,,POORLY DIFFERENTIATED,3/8/1997,15,5/7/1997,5/7/1997,Smoked in the past,R0,N0,T2,No,Black or African American,Dead,Yes,2/12/1996,Yes,13,7,,NCI_U133A_43L,B-NCI_U133A_43L.CHP,1,MSKCC,59,FEMALE
44,191,2.19,0.415,,16,WELL DIFFERENTIATED,12/7/2000,52.1,12/7/2000,,Smoked in the past,R0,N0,T1,No,White,Alive,No,8/27/1996,No,52.1,,,NCI_Lung45_U133A,A45,1,MI,69,FEMALE
176,193,1.575,0.129,,,POORLY DIFFERENTIATED,7/18/2003,91,7/18/2003,,Currently smoking,R0,N0,T2,No,Asian,Alive,No,1/26/1996,No,91,,,NCI_U133A_26L,B-NCI_U133A_26L.CHP,1,MSKCC,65,MALE
340,193,6.108,0.652,*,6,POORLY DIFFERENTIATED,12/26/2001,68,12/26/2001,,Smoked in the past,R0,N0,T2,Yes,White,Alive,No,5/26/1996,No,68,,,CL2005060340AA,D123,1,DFCI,60,MALE
234,193,0.965,0.116,,,POORLY DIFFERENTIATED,6/16/2003,88,6/16/2003,,Smoked in the past,R0,N0,T1,No,White,Alive,Yes,3/24/1996,No,88,,,NCI_U133A_84L,B-NCI_U133A_84L.CHP,1,MSKCC,58,FEMALE
206,193,0.974,0.09,,,POORLY DIFFERENTIATED,12/11/1998,42,8/8/1999,8/8/1999,Smoked in the past,R0,N2,T2,Yes,White,Dead,Yes,2/25/1996,Yes,34,27,,NCI_U133A_56L,B-NCI_U133A_56L.CHP,1,MSKCC,50,FEMALE
535,192,2.998,0.173,,11,POORLY DIFFERENTIATED,6/1/1999,27.66,6/13/1999,6/13/1999,Currently smoking,R0,N1,T2,No,White,Dead,No,3/6/1997,Yes,27.26,11.3,,Moff 4172B,C4172B,1,HLM,57,FEMALE
116,192,1.391,0.133,,21,POORLY DIFFERENTIATED,6/23/2001,56.32,6/23/2001,,Unknown,R0,N0,T1,Unknown,White,Alive,Unknown,11/7/1996,Yes,56.32,29,,NCI_lung220_U133A,A220,1,MI,75,FEMALE
70,192,1.616,0.274,,17,Moderate Differentiation,7/6/1997,9.6,7/7/1997,7/7/1997,Smoked in the past,R0,N2,T2,No,White,Dead,No,9/22/1996,Yes,9.57,7,,NCI_Lung_71_U133A,A71,1,MI,56,MALE
488,191,3.572,0.377,,9,WELL DIFFERENTIATED,3/24/2003,75.73,4/8/2003,4/8/2003,Never smoked,R0,N0,T2,No,White,Dead,No,1/18/1997,Yes,75.2,55.62,,Moff 2310K,C2310K,1,HLM,68,FEMALE
319,193,4.174,0.479,,6,Moderate Differentiation,5/5/1996,8,12/31/1996,12/31/1996,Smoked in the past,R0,N1,T2,Yes,Unknown,Dead,No,5/5/1996,Yes,,6,,CL2005060327AA,D105,1,DFCI,54,MALE
528,190,6.637,0.507,*,11,Moderate Differentiation,12/9/2002,70.37,12/9/2002,,Smoked in the past,R0,N0,T1,No,White,Alive,No,2/27/1997,No,70.37,,,Moff 3632H,C3632H,0,HLM,74,FEMALE
94,192,2.554,0.288,,19,Moderate Differentiation,12/4/2009,159.9,12/4/2009,,Unknown,R0,N0,T2,No,White,Alive,No,10/16/1996,No,159.9,,,NCI_Lung_96_U133A,A96,1,MI,66,MALE
604,192,3.55,0.307,,23,Moderate Differentiation,12/17/1999,33.2,12/17/1999,12/17/1999,Unknown,R0,N1,T3,Unknown,Unknown,Dead,Unknown,3/26/1997,Yes,33.2,,,NCI_lung278_U133A,A278,1,MI,68,MALE
378,194,2.217,0.19,,4,Moderate Differentiation,8/31/2002,75,8/31/2002,,Smoked in the past,R0,N0,T2,Unknown,Not Reported,Alive,Unknown,7/3/1996,,75,,,CL20041119187AA,D262,1,DFCI,75,MALE
700_Stratagene_reference12,,,,,,,,,,,,,,,,,,,,,,,,NCI_control17_U133,,1,MI,,
358,193,3.366,0.475,,2,POORLY DIFFERENTIATED,11/14/2001,66,11/14/2001,,Never smoked,R0,N0,T2,Unknown,Not Reported,Alive,Unknown,6/13/1996,,66,,,CL20041110100AA,D169,1,DFCI,73,MALE
171,193,1.871,0.31,,,POORLY DIFFERENTIATED,9/17/1996,14,3/16/1997,3/16/1997,Currently smoking,R0,N2,T2,Yes,White,Dead,Yes,1/21/1996,Yes,8,8,,NCI_U133A_21L,B-NCI_U133A_21L.CHP,1,MSKCC,52,FEMALE
37,192,5.681,0.353,*,15,POORLY DIFFERENTIATED,7/15/2003,84,7/15/2003,,Smoked in the past,R0,N0,T1,No,Black or African American,Alive,No,8/20/1996,No,84,,,NCI_Lung38_U133A,A38,1,MI,69,MALE
218,192,1.925,0.127,,,Moderate Differentiation,7/21/1999,41,7/21/1999,,Smoked in the past,R0,N0,T2,No,White,Alive,No,3/8/1996,Yes,41,26,,NCI_U133A_68L,B-NCI_U133A_68L.CHP,1,MSKCC,61,MALE
15,192,2.378,0.356,,13,POORLY DIFFERENTIATED,7/31/2000,48.8,8/1/2000,8/1/2000,Smoked in the past,R0,N0,T2,No,White,Dead,No,7/29/1996,Yes,48.77,36,,NCI_Lung_16_U133A,A16,1,MI,66,FEMALE
463,192,2.325,0.21,,10,Moderate Differentiation,8/5/1999,31.84,8/6/1999,8/6/1999,Smoked in the past,R0,N0,T2,No,White,Dead,No,12/24/1996,Yes,31.83,5.65,,Moff 0895B,C0895B,0,HLM,70,MALE
223,192,1.319,0.106,,,Moderate Differentiation,9/18/2000,57,11/17/2000,11/17/2000,Smoked in the past,R0,N0,T2,Yes,Black or African American,Dead,No,3/13/1996,Yes,55,5,,NCI_U133A_73L,B-NCI_U133A_73L.CHP,1,MSKCC,70,FEMALE
512,192,3.343,0.153,,7,POORLY DIFFERENTIATED,10/2/1997,52.07,5/23/2001,,Smoked in the past,R0,N0,T2,No,White,Alive,No,2/11/1997,No,7.79,,,Moff 2905B,C2905B,0,HLM,57,MALE
105,192,1.463,0.184,,20,WELL DIFFERENTIATED,8/15/1997,9.74,8/15/1997,8/15/1997,Unknown,R0,N0,T4,Unknown,White,Dead,Unknown,10/27/1996,,9.74,,,NCI_lung207_U133A,A207,1,MI,82,MALE
2,193,2.585,0.377,,12,WELL DIFFERENTIATED,8/11/1998,25.2,8/11/1998,,Smoked in the past,R0,N0,T1,No,White,Alive,No,7/16/1996,No,25.2,,,NCI_Lung_3_U133A,A3,1,MI,74,FEMALE
104,192,2.392,0.307,,20,Moderate Differentiation,4/30/2001,54.93,4/30/2001,4/30/2001,Unknown,R0,N0,T1,Unknown,White,Dead,Unknown,10/26/1996,Yes,54.93,9.6,,NCI_lung206_U133A,A206,1,MI,62,MALE
302,193,2.186,0.283,,2,WELL DIFFERENTIATED,4/8/1998,25,5/8/1998,5/8/1998,Smoked in the past,R0,N0,T2,No,Unknown,Dead,No,4/18/1996,Yes,24,14,,CL2004111022AA,D050,1,DFCI,75,MALE
186,194,21.649,1.787,*,,Moderate Differentiation,4/14/2000,51,4/14/2000,,Smoked in the past,R0,N0,T2,No,White,Alive,No,2/5/1996,No,51,,,NCI_U133A_36L,B-NCI_U133A_36L.CHP,0,MSKCC,40,MALE
479,193,2.217,0.201,,8,Moderate Differentiation,4/24/1997,3.52,4/24/1997,4/24/1997,Smoked in the past,R0,N2,T2,No,White,Dead,Yes,1/9/1997,No,3.52,,,Moff 1864H,C1864H,1,HLM,74,FEMALE
492,192,2.302,0.139,,7,Moderate Differentiation,3/31/1997,2.27,3/31/1997,3/31/1997,Smoked in the past,R1,N2,T2,Yes,White,Dead,No,1/22/1997,Unknown,2.27,,,Moff 2352G,C2352G,1,HLM,61,MALE
367,193,1.14,0.134,,3,Moderate Differentiation,10/5/1999,40,10/5/1999,,Currently smoking,R0,N0,T2,Unknown,Not Reported,Alive,Unknown,6/22/1996,,40,,,CL20041116112AA,D184,1,DFCI,58,FEMALE
248,193,3.666,0.244,,,POORLY DIFFERENTIATED,2/16/2000,47,2/16/2000,2/16/2000,Smoked in the past,R0,N0,T2,Yes,White,Dead,Yes,4/7/1996,Yes,47,11,,NCI_U133A_99L,B-NCI_U133A_99L.CHP,1,MSKCC,68,FEMALE
22,192,1.75,0.237,,14,WELL DIFFERENTIATED,2/10/2000,43.8,3/11/2000,3/11/2000,Smoked in the past,R0,N0,T2,No,White,Dead,No,8/5/1996,Yes,42.8,,,NCI_Lung_23_U133A,A23,1,MI,72,FEMALE
455,192,1.463,0.153,,10,POORLY DIFFERENTIATED,4/13/1997,8.61,8/31/1997,8/31/1997,Smoked in the past,R0,N2,T4,Yes,White,Dead,Unknown,12/16/1996,Yes,3.94,0.46,,Moff 0480I,C0480I,1,HLM,67,MALE
195,193,2.536,0.23,,,WELL DIFFERENTIATED,7/22/2000,54,7/22/2000,,Smoked in the past,R0,N0,T2,No,White,Alive,No,2/14/1996,No,54,,,NCI_U133A_45L,B-NCI_U133A_45L.CHP,1,MSKCC,82,FEMALE
164,192,1.66,0.096,,,POORLY DIFFERENTIATED,9/30/1998,40,4/28/1999,4/28/1999,Smoked in the past,R0,N0,T2,No,White,Dead,Yes,1/14/1996,Yes,33,23,,NCI_U133A_14L,B-NCI_U133A_14L.CHP,1,MSKCC,68,MALE
616,192,1.539,0.242,,24,Moderate Differentiation,6/24/1999,26.9,6/24/1999,6/24/1999,Unknown,R0,N0,T4,Unknown,Unknown,Dead,Unknown,4/8/1997,,26.9,,,NCI_lung293_U133,A293,1,MI,57,MALE
41,192,1.876,0.328,,15,POORLY DIFFERENTIATED,9/21/2005,110.5,9/21/2005,,Smoked in the past,R0,N0,T1,No,White,Alive,No,8/24/1996,No,110.5,,,NCI_Lung42_U133A,A42,1,MI,60,MALE
636,192,1.535,0.151,,26,POORLY DIFFERENTIATED,10/9/2004,97.6,5/4/2005,,Unknown,R0,N0,T2,Unknown,Unknown,Alive,Unknown,4/28/1997,,90.7,,,NCI_Lung319_U133A,A319,1,MI,81,MALE
144,192,1.418,0.125,,23,Moderate Differentiation,5/19/2000,42.04,5/19/2000,5/19/2000,Unknown,R0,N0,T1,Unknown,White,Dead,Unknown,12/5/1996,Yes,42.04,41,,NCI_lung268_U133A,A268,1,MI,62,MALE
521,191,2.248,0.27,,11,POORLY DIFFERENTIATED,8/13/2003,78.85,8/13/2003,,Smoked in the past,R0,N1,T2,No,White,Alive,No,2/20/1997,Yes,78.85,4.67,,Moff 3191I,C3191I,1,HLM,58,MALE
236,192,1.782,0.161,,,Moderate Differentiation,1/5/2000,46,1/5/2000,,Unknown,R0,N0,T1,No,White,Alive,No,3/26/1996,No,46,,,NCI_U133A_86L,B-NCI_U133A_86L.CHP,1,MSKCC,67,FEMALE
625,192,1.934,0.211,,25,Moderate Differentiation,12/29/2002,69.4,12/29/2002,,Unknown,R0,N1,T1,Unknown,Unknown,Alive,Unknown,4/17/1997,,69.4,,,NCI_Lung305_U133,A305,1,MI,63,FEMALE
127,192,2.293,0.491,,22,POORLY DIFFERENTIATED,12/1/1997,12.63,12/1/1997,12/1/1997,Unknown,R0,N0,T4,Unknown,White,Dead,Unknown,11/18/1996,,12.63,,,NCI_lung235_U133A,A235,1,MI,55,FEMALE
542,192,1.342,0.113,,8,Moderate Differentiation,5/27/1998,16.49,7/20/1998,7/20/1998,Currently smoking,R0,N1,T2,Yes,White,Dead,Yes,3/13/1997,Yes,14.69,5.62,,Moff 0542F,C542F,1,HLM,36,MALE
360,192,4.281,0.291,,2,POORLY DIFFERENTIATED,1/11/1997,7,1/11/1997,1/11/1997,Never smoked,R0,N0,T2,Unknown,Not Reported,Dead,Unknown,6/15/1996,Yes,7,5,,CL20041110103AA,D172,1,DFCI,72,MALE