Subject ID,drug_category,drug_name,number_cycles,regimen_indication,route_of_administration,therapy_ongoing,total_dose,total_dose_units,bcr_drug_barcode,days_to_drug_therapy_end,days_to_drug_therapy_start,karnofsky_performance_score,eastern_cancer_oncology_group,performance_status_scale_timing,age_at_initial_pathologic_diagnosis,anatomic_organ_subdivision,additional_pharmaceutical_therapy,additional_radiation_therapy,additional_drug_therapy,additional_immuno_therapy,additional_chemo_therapy,radiation_therapy,targeted_molecular_therapy,tumor_tissue_site,vital_status,hormonal_therapy,histological_type,informed_consent_verified,immuno_therapy,person_neoplasm_cancer_status,initial_pathologic_diagnosis_method,prior_glioma,pretreatment_history,days_to_birth,chemo_therapy,days_to_initial_pathologic_diagnosis,days_to_death,days_to_tumor_progression,days_to_last_followup,gender,days_to_tumor_recurrence,Units,radiation_regimen_indication,days_to_radiation_therapy_start,days_to_radiation_therapy_end,anatomic_treatment_site,bcr_radiation_barcode,radiation_type,radiation_treatment_ongoing,radiation_dosage,numfractions,procedure_type,days_to_procedure,bcr_surgery_barcode
TCGA-08-0346,CHEMO,Hydroxyurea,1,ADJUVANT,ORAL,null,300,mg,08-0346-C1,68,20,80,null,PRE-ADJUVANT THERAPY,69,Brain,NO,NO,NO,NO,NO,YES,NO,BRAIN,DECEASED,NO,Untreated primary (de novo) GBM,YES,NO,WITH TUMOR,TUMOR RESECTION,NO,NO,-25409,YES,0,256,75,132,MALE,,cGy,ADJUVANT,20,68,Primary Tumor Field,TCGA-08-0346-R1,EXTERNAL BEAM,null,5940,33,"Surgical Resection, Secondary Surgery for tumor recurrence/progression: Locoregional procedure","0, 130","TCGA-08-0346-S1, TCGA-08-0346-S2"
TCGA-06-5410,,,,,,,,,,,,60,null,PREOPERATIVE,72,Brain,NO,NO,NO,NO,NO,NO,NO,BRAIN,DECEASED,null,Untreated primary (de novo) GBM,YES,NO,WITH TUMOR,TUMOR RESECTION,NO,NO,-26395,NO,0,107,,107,FEMALE,,,,,,,,,,,,Surgical Resection,0,TCGA-06-5410-S1
TCGA-41-2575,"CHEMO, TARGETED","Temodar, Avastin","1, null","ADJUVANT, PROGRESSION","ORAL, INTRAVENOUS (IV)","NO, NO","7140, 800","mg, mg","41-2575-C1, 41-2575-T1","145, 166","95, 166",60,null,POST-ADJUVANT THERAPY,75,Brain,NO,YES,YES,NO,NO,YES,NO,BRAIN,DECEASED,NO,Untreated primary (de novo) GBM,YES,NO,WITH TUMOR,EXCISIONAL BIOPSY,NO,NO,-27586,YES,0,290,131,290,MALE,,"cGy, cGy","ADJUVANT, PROGRESSION","95, 167","145, 169","Primary Tumor Field, Local Recurrence","TCGA-41-2575-R1, TCGA-41-2575-R2","EXTERNAL BEAM, EXTERNAL BEAM","NO, NO","6000, 1800","30, 3",Surgical Resection,74,TCGA-41-2575-S1
TCGA-12-3650,"CHEMO, CHEMO, CHEMO, CHEMO, CHEMO, CHEMO, TARGETED, TARGETED, TARGETED, TARGETED, TARGETED, TARGETED","Temodar, CPT 11, Temodar, CPT 11, Temodar, VP 16, Avastin, Avastin, Avastin, Tarceva, Avastin, Avastin","1, 2, 2, 3, 3, 1, null, null, null, null, null, null","ADJUVANT, ADJUVANT, ADJUVANT, ADJUVANT, PROGRESSION, PROGRESSION, ADJUVANT, ADJUVANT, ADJUVANT, RECURRENCE, RECURRENCE, RECURRENCE","ORAL, INTRAVENOUS (IV), ORAL, INTRAVENOUS (IV), ORAL, ORAL, INTRAVENOUS (IV), INTRAVENOUS (IV), INTRAVENOUS (IV), ORAL, INTRAVENOUS (IV), INTRAVENOUS (IV)","NO, NO, NO, NO, NO, NO, NO, NO, NO, NO, NO, NO","6930, 6120, 2000, 1620, 3000, 2100, 3003, 3892, 5838, 11200, 3860, 1894","mg, mg, mg, mg, mg, mg, mg, mg, mg, mg, mg, mg","12-3650-C1, 12-3650-C2, 12-3650-C3, 12-3650-C4, 12-3650-C5, 12-3650-C6, 12-3650-T1, 12-3650-T2, 12-3650-T3, 12-3650-T4, 12-3650-T5, 12-3650-T6","72, 148, 148, 239, 239, 333, 72, 148, 239, 307, 307, 333","26, 91, 91, 152, 152, 307, 26, 91, 148, 239, 239, 307",80,null,PRE-ADJUVANT THERAPY,46,Brain,NO,NO,YES,NO,YES,YES,YES,BRAIN,DECEASED,NO,Untreated primary (de novo) GBM,YES,NO,WITH TUMOR,EXCISIONAL BIOPSY,NO,NO,-17138,YES,0,333,239,333,MALE,,cGy,ADJUVANT,26,72,Primary Tumor Field,TCGA-12-3650-R1,EXTERNAL BEAM,NO,5940,33,Surgical Resection,0,TCGA-12-3650-S1
TCGA-19-1389,"CHEMO, CHEMO, CHEMO","Temozolomide, Temozolomide, Temozolomide","1, 1, 1","ADJUVANT, ADJUVANT, ADJUVANT","ORAL, ORAL, ORAL","NO, NO, NO","3600, 1980, 2880","mg, mg, mg","19-1389-C1, 19-1389-C2, 19-1389-C3","67, 20, 41","48, 10, 26",80,null,PRE-ADJUVANT THERAPY,51,Brain,NO,NO,NO,NO,NO,YES,NO,BRAIN,DECEASED,NO,Untreated primary (de novo) GBM,YES,NO,WITH TUMOR,TUMOR RESECTION,NO,NO,-18659,YES,0,141,,141,MALE,81,cGy,ADJUVANT,26,67,Primary Tumor Field,TCGA-19-1389-R2,EXTERNAL BEAM,NO,6000,30,"Surgical Resection, Secondary Surgery for tumor recurrence/progression: Locoregional procedure","-3, 81","TCGA-19-1389-S1, TCGA-19-1389-S2"
TCGA-28-2514,CHEMO,Temozolomide,null,ADJUVANT,ORAL,YES,null,mg/m2,28-2514-C1,null,29,60,null,POST-ADJUVANT THERAPY,45,Brain,NO,NO,NO,NO,NO,YES,NO,BRAIN,LIVING,NO,Untreated primary (de novo) GBM,YES,NO,null,TUMOR RESECTION,NO,NO,-16736,YES,0,,,160,MALE,,cGy,ADJUVANT,26,75,Primary Tumor Field,TCGA-28-2514-R1,EXTERNAL BEAM,NO,6000,30,Surgical Resection,0,TCGA-28-2514-S1
TCGA-26-1442,,,,,,,,,,,,,,,,null,null,null,null,null,null,null,null,null,null,null,null,null,null,null,null,null,null,,null,,,,,null,,,,,,,,,,,,,,
TCGA-06-0174,,,,,,,,,,,,80,null,PREOPERATIVE,54,Brain,NO,YES,NO,NO,YES,YES,NO,BRAIN,DECEASED,NO,Untreated primary (de novo) GBM,YES,NO,WITH TUMOR,TUMOR RESECTION,NO,NO,-19824,YES,0,98,47,67,MALE,,,,,,,,,,,,Surgical Resection,0,TCGA-06-0174-S1
TCGA-06-2569,,,,,,,,,,,,80,null,PREOPERATIVE,24,Brain,NO,NO,NO,NO,NO,null,null,BRAIN,LIVING,null,Untreated primary (de novo) GBM,YES,null,WITH TUMOR,TUMOR RESECTION,NO,NO,-8921,null,0,,,13,FEMALE,,,,,,,,,,,,Surgical Resection,0,TCGA-06-2569-S1
TCGA-02-0321,,,,,,,,,,,,80,null,null,74,Brain,NO,NO,NO,NO,null,YES,NO,BRAIN,DECEASED,NO,Untreated primary (de novo) GBM,YES,NO,WITH TUMOR,TUMOR RESECTION,NO,NO,-27125,null,0,300,73,300,MALE,,,,,,,,,,,,"Surgical Resection, Secondary Surgery for tumor recurrence/progression: Locoregional procedure","3, 74","TCGA-02-0321-S1, TCGA-02-0321-S2"
TCGA-02-0052,CHEMO,Temozolomide,5,ADJUVANT,ORAL,NO,200,mg/m2/day,02-0052-C1,204,34,80,null,null,49,Brain,NO,NO,NO,NO,NO,YES,NO,BRAIN,DECEASED,NO,Untreated primary (de novo) GBM,YES,NO,WITH TUMOR,TUMOR RESECTION,NO,NO,-18060,YES,0,383,204,383,MALE,,cGy,ADJUVANT,16,57,Primary Tumor Field,TCGA-02-0052-R1,EXTERNAL BEAM,NO,6000,30,Surgical Resection,0,TCGA-02-0052-S1
TCGA-76-4929,,,,,,,,,,,,,,,,null,null,null,null,null,null,null,null,null,null,null,null,null,null,null,null,null,null,,null,,,,,null,,,,,,,,,,,,,,
TCGA-06-0158,,,,,,,,,,,,80,null,PREOPERATIVE,73,Brain,NO,NO,NO,NO,YES,YES,NO,BRAIN,DECEASED,NO,Untreated primary (de novo) GBM,YES,NO,WITH TUMOR,TUMOR RESECTION,NO,NO,-26855,NO,0,329,90,166,MALE,,,,,,,,,,,,Surgical Resection,0,TCGA-06-0158-S1
TCGA-26-1438,"CHEMO, CHEMO, CHEMO, TARGETED","Temozolomide, Temozolomide, Lomustine, Recentin Placebo AXDX2171","1, 4, 1, null","ADJUVANT, ADJUVANT, PROGRESSION, PROGRESSION","ORAL, ORAL, ORAL, null","NO, NO, NO, NO","5670, 1440, 210, 880","mg, mg, mg, mg","26-1438-C1, 26-1438-C2, 26-1438-C3, 26-1438-T3","73, 206, 221, 264","31, 104, 221, 221",100,0,PRE-ADJUVANT THERAPY,36,Brain,NO,NO,YES,NO,YES,YES,NO,BRAIN,LIVING,NO,Untreated primary (de novo) GBM,YES,NO,WITH TUMOR,TUMOR RESECTION,NO,NO,-13489,YES,0,,158,305,MALE,,cGy,ADJUVANT,31,73,Primary Tumor Field,TCGA-26-1438-R1,EXTERNAL BEAM,NO,6000,30,"Surgical Resection, Secondary Surgery for tumor recurrence/progression: Locoregional procedure","0, 297","TCGA-26-1438-S1, TCGA-26-1438-S2"
TCGA-12-3652,"CHEMO, CHEMO, CHEMO, CHEMO, CHEMO, CHEMO, TARGETED, TARGETED, TARGETED, TARGETED","Temodar, CCNU, CCNU, Temodar, VP 16, VP 16, Hydroxurea, Hydroxurea, Gleevac, Gleevac","2, 1, 1, 2, 1, 4, null, null, null, null","ADJUVANT, ADJUVANT, ADJUVANT, RECURRENCE, RECURRENCE, RECURRENCE, RECURRENCE, RECURRENCE, RECURRENCE, RECURRENCE","ORAL, ORAL, ORAL, ORAL, ORAL, ORAL, ORAL, ORAL, ORAL, ORAL","NO, NO, NO, NO, NO, NO, NO, NO, NO, NO","3000, 220, 160, 4000, 1575, 8400, 14000, 2800, 56000, 8400","mg, mg, mg, mg, mg, mg, mg, mg, mg, mg","12-3652-C1, 12-3652-C2, 12-3652-C3, 12-3652-C4, 12-3652-C5, 12-3652-C6, 12-3652-T1, 12-3652-T2, 12-3652-T3, 12-3652-T4","67, 133, 203, 288, 358, 571, 750, 792, 750, 792","21, 91, 161, 228, 291, 469, 585, 750, 585, 750",80,null,PRE-ADJUVANT THERAPY,60,Brain,NO,NO,YES,NO,YES,YES,YES,BRAIN,DECEASED,NO,Untreated primary (de novo) GBM,YES,NO,WITH TUMOR,EXCISIONAL BIOPSY,NO,NO,-21920,YES,0,1062,203,1050,MALE,,cGy,ADJUVANT,21,60,Primary Tumor Field,TCGA-12-3652-R1,EXTERNAL BEAM,NO,5800,29,Surgical Resection,0,TCGA-12-3652-S1
TCGA-19-5952,,,,,,,,,,,,,,,,null,null,null,null,null,null,null,null,null,null,null,null,null,null,null,null,null,null,,null,,,,,null,,,,,,,,,,,,,,
TCGA-06-1804,,,,,,,,,,,,,,,,null,null,null,null,null,null,null,null,null,null,null,null,null,null,null,null,null,null,,null,,,,,null,,,,,,,,,,,,,,
TCGA-06-0171,,,,,,,,,,,,100,null,PREOPERATIVE,65,Brain,NO,NO,NO,NO,YES,YES,NO,BRAIN,DECEASED,NO,Untreated primary (de novo) GBM,YES,NO,WITH TUMOR,TUMOR RESECTION,NO,NO,-24085,YES,0,399,117,396,MALE,,,,,,,,,,,,"Surgical Resection, Secondary Surgery for tumor recurrence/progression: Locoregional procedure","0, 119","TCGA-06-0171-S1, TCGA-06-0171-S2"
TCGA-12-0662,"CHEMO, CHEMO, CHEMO, CHEMO, CHEMO, CHEMO, CHEMO, CHEMO, CHEMO, CHEMO, CHEMO, HORMONAL, HORMONAL, IMMUNO, IMMUNO, TARGETED, TARGETED","Gliadel Wafers, CPT-11, VP-16, Cytoxan, Temodar, CCNU, VP-16, CCNU, VP-16, Temodar, Temodar, Tamoxiten, Tamoxifen, Celbrex, Thalidomide, 06GB, 06GB","1, 3, 1, 1, null, 2, 2, 2, 2, 1, 7, null, null, null, null, null, null","PROGRESSION, PROGRESSION, PROGRESSION, PROGRESSION, PROGRESSION, ADJUVANT, ADJUVANT, ADJUVANT, ADJUVANT, PROGRESSION, PROGRESSION, ADJUVANT, ADJUVANT, PROGRESSION, PROGRESSION, PROGRESSION, PROGRESSION","INTRATUMORAL, INTRAVENOUS (IV), ORAL, ORAL, ORAL, ORAL, ORAL, ORAL, ORAL, ORAL, ORAL, null, null, ORAL, null, null, null","null, null, null, null, null, null, null, null, null, null, null, null, null, null, null, null, null","8, 75, 50, 100, 10, 110, 100, 110, 100, 150, 200, 100, 200, 400, 400, 120, 30","{Wafer}, mg/m2, mg/m2, mg, mg/m2, mg/m2, mg/m2, mg/m2, mg/m2, mg/m2, mg/m2, mg, mg, mg, mg, mg/m2, mg/m2","12-0662-C10, 12-0662-C11, 12-0662-C12, 12-0662-C13, 12-0662-C14, 12-0662-C2, 12-0662-C3, 12-0662-C5, 12-0662-C6, 12-0662-C8, 12-0662-C9, 12-0662-H3, 12-0662-H6, 12-0662-I1, 12-0662-I14, 12-0662-T1, 12-0662-T2","875, 1028, 1070, 1070, 1137, 220, 278, 417, 472, 603, 843, 334, 599, 1161, 1090, 1135, 1135","875, 888, 1041, 1041, 1133, 119, 223, 340, 417, 599, 626, 278, 472, 1113, 1073, 1133, 1133",80,null,POST-ADJUVANT THERAPY,51,Brain,YES,NO,YES,YES,YES,YES,YES,BRAIN,DECEASED,YES,Untreated primary (de novo) GBM,YES,YES,WITH TUMOR,EXCISIONAL BIOPSY,NO,NO,-18717,YES,0,1161,599,1161,MALE,,cGy,ADJUVANT,47,87,Primary Tumor Field,TCGA-12-0662-R1,EXTERNAL BEAM,null,5800,33,"Surgical Resection, Secondary Surgery for tumor recurrence/progression: Locoregional procedure","11, 857","TCGA-12-0662-S1, TCGA-12-0662-S2"
TCGA-15-1444,,,,,,,,,,,,,,,,null,null,null,null,null,null,null,null,null,null,null,null,null,null,null,null,null,null,,null,,,,,null,,,,,,,,,,,,,,
TCGA-08-0373,,,,,,,,,,,,,null,null,69,Brain,null,null,null,null,null,null,null,BRAIN,DECEASED,null,Untreated primary (de novo) GBM,YES,null,WITH TUMOR,TUMOR RESECTION,NO,NO,-25273,null,0,134,,134,MALE,,,,,,,,,,,,Surgical Resection,0,TCGA-08-0373-S1
TCGA-27-2523,"CHEMO, CHEMO, CHEMO, CHEMO, HORMONAL, HORMONAL","Cisplatin, Lumustine, Temozolomide, Erlotinib, Dexamethasone, Phenytoin Sodium","2, 1, 10, 10, null, null","ADJUVANT, ADJUVANT, ADJUVANT, ADJUVANT, ADJUVANT, ADJUVANT","INTRAVENOUS (IV), ORAL, ORAL, ORAL, ORAL, ORAL","NO, NO, NO, NO, NO, NO","315, 160, 15000, 1500, 3960, 148500","mg, mg, mg, mg, mg, mg","27-2523-C1, 27-2523-C2, 27-2523-C3, 27-2523-C4, 27-2523-H1, 27-2523-H2","59, 11, 380, 396, 489, 489","10, 11, 60, 97, -6, -6",80,1,PREOPERATIVE,63,Brain,NO,NO,NO,NO,NO,YES,NO,BRAIN,DECEASED,YES,Untreated primary (de novo) GBM,YES,NO,WITH TUMOR,TUMOR RESECTION,NO,NO,-23034,YES,0,489,402,489,MALE,,"cGy, cGy","ADJUVANT, ADJUVANT","29, 55","36, 60","Primary Tumor Field, Primary Tumor Field","TCGA-27-2523-R1, TCGA-27-2523-R2","EXTERNAL BEAM, EXTERNAL BEAM","NO, NO","3000, 3000","15, 15",Surgical Resection,-6,TCGA-27-2523-S1
TCGA-08-0350,"CHEMO, TARGETED","Temodor, Tarceva","5, null","PROGRESSION, PROGRESSION","ORAL, null","NO, NO","null, 450","null, mg/day","08-0350-C1, 08-0350-T2","637, 837","455, 678",80,null,POST-ADJUVANT THERAPY,32,Brain,NO,NO,YES,NO,YES,YES,NO,BRAIN,DECEASED,NO,Untreated primary (de novo) GBM,YES,NO,WITH TUMOR,TUMOR RESECTION,NO,NO,-11905,NO,0,888,,103,MALE,438,"mCi, cGy","ADJUVANT, ADJUVANT","0, 40","0, 78","Primary Tumor Field, Primary Tumor Field","TCGA-08-0350-R1, TCGA-08-0350-R2","IMPLANTS, EXTERNAL BEAM","NO, NO","21, 6540","24, 60",Surgical Resection,0,TCGA-08-0350-S1
TCGA-27-1835,"CHEMO, CHEMO, CHEMO, CHEMO, CHEMO, HORMONAL, HORMONAL","Cisplatin, Temozolomide, PC2, FT, BCNU, Levetiracetam, Dexamethasone","1, 3, 5, 1, 1, null, null","ADJUVANT, ADJUVANT, RECURRENCE, RECURRENCE, RECURRENCE, ADJUVANT, ADJUVANT","INTRAVENOUS (IV), ORAL, ORAL, INTRAVENOUS (IV), INTRAVENOUS (IV), ORAL, ORAL","NO, NO, NO, NO, NO, NO, NO","160, 4300, 8400, 12, 200, 654000, 1308","mg, mg, mg, mL, mg, mg, mg","27-1835-C2, 27-1835-C3, 27-1835-C4, 27-1835-C5, 27-1835-C6, 27-1835-H1, 27-1835-H2","3, 153, 457, 208, 270, 648, 648","2, 4, 206, 208, 270, -7, -7",80,1,PREOPERATIVE,53,Brain,NO,NO,NO,NO,YES,YES,NO,BRAIN,DECEASED,YES,Untreated primary (de novo) GBM,YES,NO,WITH TUMOR,TUMOR RESECTION,NO,NO,-19443,YES,0,648,157,648,FEMALE,,cGy,ADJUVANT,55,100,Primary Tumor Field,TCGA-27-1835-R2,EXTERNAL BEAM,NO,6000,30,Surgical Resection,-7,TCGA-27-1835-S1
TCGA-02-0034,CHEMO,Temozolomide,2,ADJUVANT,ORAL,NO,200,mg/m2/day,02-0034-C1,159,89,80,null,null,60,Brain,NO,NO,NO,NO,NO,YES,NO,BRAIN,DECEASED,NO,Untreated primary (de novo) GBM,YES,NO,WITH TUMOR,TUMOR RESECTION,NO,NO,-22166,YES,0,430,386,430,MALE,,cGy,ADJUVANT,23,68,Primary Tumor Field,TCGA-02-0034-R1,EXTERNAL BEAM,NO,6000,30,Surgical Resection,0,TCGA-02-0034-S1
TCGA-06-0201,,,,,,,,,,,,,null,null,51,Brain,NO,NO,NO,NO,NO,NO,NO,BRAIN,DECEASED,NO,Untreated primary (de novo) GBM,YES,NO,WITH TUMOR,TUMOR RESECTION,NO,NO,-18649,NO,0,12,,12,FEMALE,,,,,,,,,,,,Surgical Resection,0,TCGA-06-0201-S1
TCGA-06-0182,,,,,,,,,,,,60,null,PREOPERATIVE,76,Brain,NO,NO,NO,NO,NO,NO,NO,BRAIN,DECEASED,NO,Untreated primary (de novo) GBM,YES,NO,WITH TUMOR,TUMOR RESECTION,NO,NO,-27963,NO,0,111,,77,MALE,,,,,,,,,,,,Surgical Resection,0,TCGA-06-0182-S1
TCGA-06-2558,,,,,,,,,,,,60,null,PREOPERATIVE,75,Brain,NO,YES,NO,NO,NO,YES,null,BRAIN,DECEASED,null,Untreated primary (de novo) GBM,YES,null,null,TUMOR RESECTION,NO,NO,-27511,null,0,380,,23,FEMALE,,cGy,ADJUVANT,29,71,Primary Tumor Field,TCGA-06-2558-R1,EXTERNAL BEAM,NO,59,28,Surgical Resection,0,TCGA-06-2558-S1
TCGA-06-0397,,,,,,,,,,,,,null,PREOPERATIVE,57,Brain,NO,YES,NO,NO,YES,YES,NO,BRAIN,DECEASED,NO,Untreated primary (de novo) GBM,YES,NO,WITH TUMOR,TUMOR RESECTION,NO,NO,-20997,YES,0,121,,15,FEMALE,,,,,,,,,,,,"Surgical Resection, Secondary Surgery for tumor recurrence/progression: Locoregional procedure","-153, -133","TCGA-06-0397-S1, TCGA-06-0397-S2"
TCGA-32-4211,"CHEMO, CHEMO, CHEMO","Temodar, Temodar, Temodar","1, 1, 1","ADJUVANT, ADJUVANT, ADJUVANT","ORAL, ORAL, ORAL","NO, NO, NO","null, null, null","mg/day, mg/day, mg/day","32-4211-C1, 32-4211-C2, 32-4211-C3","64, 96, 130","24, 92, 126",,null,null,56,Brain,NO,NO,NO,NO,NO,YES,NO,BRAIN,DECEASED,NO,Untreated primary (de novo) GBM,YES,NO,WITH TUMOR,TUMOR RESECTION,NO,NO,-20748,YES,0,383,,383,MALE,,cGy,ADJUVANT,24,64,Primary Tumor Field,TCGA-32-4211-R1,EXTERNAL BEAM,NO,6000,30,Surgical Resection,0,TCGA-32-4211-S1
TCGA-06-0132,,,,,,,,,,,,,null,null,49,Brain,NO,NO,YES,NO,YES,YES,NO,BRAIN,DECEASED,NO,Untreated primary (de novo) GBM,YES,NO,WITH TUMOR,TUMOR RESECTION,NO,NO,-18125,YES,0,771,482,570,MALE,,,,,,,,,,,,Surgical Resection,0,TCGA-06-0132-S1
TCGA-06-0190,,,,,,,,,,,,80,null,null,62,Brain,NO,NO,YES,NO,YES,YES,NO,BRAIN,DECEASED,NO,Untreated primary (de novo) GBM,YES,NO,WITH TUMOR,TUMOR RESECTION,NO,NO,-22835,YES,0,317,88,313,MALE,,,,,,,,,,,,"Surgical Resection, Secondary Surgery for tumor recurrence/progression: Locoregional procedure","0, -144","TCGA-06-0190-S1, TCGA-06-0190-S2"
TCGA-19-4068,"CHEMO, CHEMO","Temodar, Temodar","1, 1","ADJUVANT, ADJUVANT","ORAL, ORAL","NO, NO","1200, 2835","mg, mg","19-4068-C1, 19-4068-C2","74, 108","60, 82",80,null,PRE-ADJUVANT THERAPY,68,Brain,NO,NO,NO,NO,NO,YES,NO,BRAIN,LIVING,NO,Untreated primary (de novo) GBM,YES,NO,TUMOR FREE,TUMOR RESECTION,NO,NO,-24945,YES,0,,,136,FEMALE,,"null, null","ADJUVANT, ADJUVANT","60, 79","74, 108","Primary Tumor Field, Primary Tumor Field","TCGA-19-4068-R1, TCGA-19-4068-R2","EXTERNAL BEAM, EXTERNAL BEAM","NO, NO","null, null","null, null",Surgical Resection,0,TCGA-19-4068-S1
TCGA-08-0355,"CHEMO, CHEMO, CHEMO, CHEMO, TARGETED, TARGETED, TARGETED","Temodor, Temodor, BCNU, Carboplatin, Thalomid, Tamoxifen, Enzastaurin","1, 14, 1, 1, null, null, null","ADJUVANT, ADJUVANT, PROGRESSION, PROGRESSION, PROGRESSION, PROGRESSION, PROGRESSION","ORAL, ORAL, INTRAVENOUS (IV), INTRAVENOUS (IV), null, null, null","null, NO, null, null, null, null, null","75, 150, 210, 590, 1000, 540, null","mg/m2, mg/m2, mg, mg, mg/day, mg, null","08-0355-C1, 08-0355-C2, 08-0355-C3, 08-0355-C4, 08-0355-T3, 08-0355-T4, 08-0355-T5","68, 498, 531, 582, 572, 607, 671","25, 88, 531, 582, 531, 573, 640",100,null,OTHER,30,Brain,NO,NO,YES,NO,YES,YES,YES,BRAIN,DECEASED,NO,Untreated primary (de novo) GBM,YES,NO,WITH TUMOR,TUMOR RESECTION,NO,NO,-11098,YES,0,747,,685,FEMALE,519,cGy,ADJUVANT,25,68,Primary Tumor Field,TCGA-08-0355-R1,EXTERNAL BEAM,null,null,null,"Surgical Resection, Secondary Surgery for tumor recurrence/progression: Locoregional procedure","0, 615","TCGA-08-0355-S1, TCGA-08-0355-S2"
TCGA-02-0057,"CHEMO, CHEMO","Gliadel Wafer, Temozolomide","null, null","ADJUVANT, RECURRENCE","OTHER: SPECIFY IN NOTES, ORAL","NO, null","1, null","null, null","02-0057-C1, 02-0057-C2","null, null","1, null",80,null,null,66,Brain,NO,NO,NO,NO,YES,YES,NO,BRAIN,DECEASED,NO,Treated primary GBM,YES,NO,WITH TUMOR,TUMOR RESECTION,NO,YES,-24139,YES,0,604,473,604,FEMALE,,cGy,ADJUVANT,16,63,Primary Tumor Field,TCGA-02-0057-R1,EXTERNAL BEAM,NO,6480,30,Surgical Resection,0,TCGA-02-0057-S1
TCGA-32-1980,,,,,,,,,,,,,,,,null,null,null,null,null,null,null,null,null,null,null,null,null,null,null,null,null,null,,null,,,,,null,,,,,,,,,,,,,,
TCGA-32-2494,"CHEMO, CHEMO, CHEMO, CHEMO, CHEMO, TARGETED, TARGETED","Temodar, Temodar, Temodar, Temodar, Temodar, Avastin, Avastin","null, 1, 11, 4, 1, null, null","ADJUVANT, ADJUVANT, ADJUVANT, PROGRESSION, PROGRESSION, PROGRESSION, PROGRESSION","ORAL, ORAL, ORAL, ORAL, ORAL, ORAL, INTRAVENOUS (IV)","NO, NO, NO, NO, NO, NO, NO","75, 150, 200, null, null, null, 10","mg/m2, mg/m2, mg/m2, mg/day, mg/day, mg, mg/kg","32-2494-C1, 32-2494-C2, 32-2494-C3, 32-2494-C4, 32-2494-C5, 32-2494-T1, 32-2494-T2","62, 94, 403, 550, 632, 550, 620","20, 90, 120, 488, 620, 488, 620",,null,null,58,Brain,NO,YES,NO,NO,YES,YES,NO,BRAIN,DECEASED,NO,Untreated primary (de novo) GBM,YES,NO,WITH TUMOR,TUMOR RESECTION,NO,NO,-21198,YES,0,632,488,632,FEMALE,,"cGy, null, cGy","ADJUVANT, ADJUVANT, PROGRESSION","21, 21, 501","62, 62, 518","Primary Tumor Field, null, Local Recurrence","TCGA-32-2494-R1, TCGA-32-2494-R2, TCGA-32-2494-R3","EXTERNAL BEAM, RADIOISOTOPES, EXTERNAL BEAM","NO, NO, NO","6000, 354, 3900","30, 30, 12",Surgical Resection,0,TCGA-32-2494-S1
TCGA-76-6282,,,,,,,,,,,,,,,,null,null,null,null,null,null,null,null,null,null,null,null,null,null,null,null,null,null,,null,,,,,null,,,,,,,,,,,,,,
TCGA-16-1056,,,,,,,,,,,,,null,null,55,Brain,NO,NO,NO,NO,NO,YES,NO,BRAIN,DECEASED,NO,Untreated primary (de novo) GBM,YES,NO,WITH TUMOR,TUMOR RESECTION,NO,NO,-20309,YES,0,426,,406,MALE,239,cGy,ADJUVANT,20,62,Primary Tumor Field,TCGA-16-1056-R1,EXTERNAL BEAM,NO,6000,30,Surgical Resection,0,TCGA-16-1056-S1
TCGA-16-1047,,,,,,,,,,,,,null,null,66,Brain,NO,NO,NO,NO,NO,NO,NO,BRAIN,DECEASED,NO,Untreated primary (de novo) GBM,YES,NO,WITH TUMOR,TUMOR RESECTION,YES,NO,-24300,NO,0,139,25,25,FEMALE,,,,,,,,,,,,Surgical Resection,0,TCGA-16-1047-S1
TCGA-06-0240,,,,,,,,,,,,,,,,null,null,null,null,null,null,null,null,null,null,null,null,YES,null,null,null,null,null,,null,,,,,null,,,,,,,,,,,,,,
TCGA-06-0173,,,,,,,,,,,,,null,null,72,Brain,NO,NO,NO,NO,NO,NO,NO,BRAIN,DECEASED,NO,Untreated primary (de novo) GBM,YES,NO,WITH TUMOR,TUMOR RESECTION,NO,NO,-26548,NO,0,136,,7,FEMALE,,,,,,,,,,,,Surgical Resection,0,TCGA-06-0173-S1
TCGA-27-1834,"CHEMO, CHEMO, CHEMO, CHEMO, CHEMO, HORMONAL","Procarbazine, Temozolomide, Fotemustine, Temozolomoide, Cisplatin, Dexamethasone","6, null, 6, 5, 5, null","ADJUVANT, ADJUVANT, ADJUVANT, ADJUVANT, ADJUVANT, ADJUVANT","OTHER: SPECIFY IN NOTES, ORAL, OTHER: SPECIFY IN NOTES, OTHER: SPECIFY IN NOTES, OTHER: SPECIFY IN NOTES, null","NO, YES, NO, NO, NO, NO","1248, 35000, 1200, 6250, 320, 7302","mg, mg, mg, mg, mg, mg","27-1834-C1, 27-1834-C2, 27-1834-C3, 27-1834-C4, 27-1834-C5, 27-1834-H2","539, 662, 539, 180, 180, 1232","365, 365, 365, 28, 28, -5",80,1,PRE-ADJUVANT THERAPY,56,Brain,NO,NO,NO,NO,YES,YES,NO,BRAIN,DECEASED,YES,Untreated primary (de novo) GBM,YES,NO,WITH TUMOR,TUMOR RESECTION,NO,NO,-20568,YES,0,1232,,1008,MALE,335,cGy,ADJUVANT,27,63,Primary Tumor Field,TCGA-27-1834-R1,EXTERNAL BEAM,NO,6000,30,Surgical Resection,-5,TCGA-27-1834-S1
TCGA-19-1790,CHEMO,Temozolomide,1,ADJUVANT,ORAL,NO,5880,mg,19-1790-C2,66,25,60,null,POST-ADJUVANT THERAPY,56,Brain,NO,NO,NO,NO,NO,YES,NO,BRAIN,DECEASED,NO,Untreated primary (de novo) GBM,YES,NO,WITH TUMOR,TUMOR RESECTION,NO,NO,-20626,YES,0,153,87,153,MALE,,cGy,ADJUVANT,25,66,Primary Tumor Field,TCGA-19-1790-R2,EXTERNAL BEAM,NO,6000,30,Surgical Resection,0,TCGA-19-1790-S1
TCGA-14-0866,"CHEMO, HORMONAL","Temodar, Dexamethasone","7, null","OTHER: SPECIFY IN NOTES, OTHER: SPECIFY IN NOTES","ORAL, null","NO, null","62415, null","mg, null","14-0866-C1, 14-0866-H1","325, null","21, 0",80,null,PRE-ADJUVANT THERAPY,55,Brain,YES,NO,NO,NO,YES,YES,NO,BRAIN,DECEASED,YES,Untreated primary (de novo) GBM,YES,NO,null,TUMOR RESECTION,NO,NO,-20179,YES,0,801,,801,MALE,97,cGy,ADJUVANT,31,70,Primary Tumor Field,TCGA-14-0866-R1,EXTERNAL BEAM,NO,6000,30,"Surgical Resection, Secondary Surgery for tumor recurrence/progression: Locoregional procedure","0, 237","TCGA-14-0866-S1, TCGA-14-0866-S2"
TCGA-06-0156,,,,,,,,,,,,,null,null,57,Brain,NO,NO,NO,NO,NO,YES,NO,BRAIN,DECEASED,YES,Untreated primary (de novo) GBM,YES,NO,WITH TUMOR,TUMOR RESECTION,NO,NO,-20931,NO,0,178,,164,MALE,,,,,,,,,,,,Surgical Resection,30,TCGA-06-0156-S1
TCGA-06-0124,CHEMO,temozolomide,null,ADJUVANT,ORAL,NO,null,null,06-0124-C1,1400,1066,,null,null,67,Brain,null,null,null,null,null,YES,null,BRAIN,DECEASED,null,Untreated primary (de novo) GBM,YES,null,WITH TUMOR,TUMOR RESECTION,NO,NO,-24591,YES,0,619,,123,MALE,,,,,,,,,,,,Surgical Resection,0,TCGA-06-0124-S1
TCGA-06-0749,,,,,,,,,,,,,null,null,50,Brain,NO,NO,NO,NO,NO,YES,NO,BRAIN,DECEASED,NO,Untreated primary (de novo) GBM,YES,NO,WITH TUMOR,TUMOR RESECTION,NO,NO,-18571,YES,0,81,,65,MALE,,,,,,,,,,,,Surgical Resection,0,TCGA-06-0749-S1
TCGA-02-0051,,,,,,,,,,,,100,null,null,43,Brain,NO,NO,NO,NO,YES,YES,NO,BRAIN,DECEASED,NO,Untreated primary (de novo) GBM,YES,NO,WITH TUMOR,TUMOR RESECTION,NO,NO,-15983,YES,0,458,88,458,MALE,,,,,,,,,,,,"Surgical Resection, Secondary Surgery for tumor recurrence/progression: Locoregional procedure","0, 413","TCGA-02-0051-S1, TCGA-02-0051-S2"