Subject ID,age_at_initial_pathologic_diagnosis,anatomic_organ_subdivision,additional_pharmaceutical_therapy,additional_radiation_therapy,additional_drug_therapy,additional_immuno_therapy,additional_chemo_therapy,radiation_therapy,targeted_molecular_therapy,tumor_tissue_site,vital_status,hormonal_therapy,histological_type,informed_consent_verified,immuno_therapy,person_neoplasm_cancer_status,initial_pathologic_diagnosis_method,prior_glioma,pretreatment_history,days_to_birth,chemo_therapy,days_to_initial_pathologic_diagnosis,days_to_death,days_to_tumor_progression,days_to_last_followup,gender,days_to_tumor_recurrence
TCGA-16-1047,66,Brain,NO,NO,NO,NO,NO,NO,NO,BRAIN,DECEASED,NO,Untreated primary (de novo) GBM,YES,NO,WITH TUMOR,TUMOR RESECTION,YES,NO,-24300,NO,0,139,25,25,FEMALE,
TCGA-06-0195,63,Brain,NO,NO,NO,NO,NO,YES,NO,BRAIN,DECEASED,NO,Untreated primary (de novo) GBM,YES,NO,WITH TUMOR,TUMOR RESECTION,NO,NO,-23131,YES,0,225,147,214,MALE,
TCGA-19-1385,69,Brain,NO,NO,NO,NO,YES,YES,NO,BRAIN,DECEASED,NO,Untreated primary (de novo) GBM,YES,NO,WITH TUMOR,TUMOR RESECTION,NO,NO,-25459,YES,0,327,,327,MALE,176
TCGA-19-0962,77,Brain,NO,NO,NO,NO,NO,NO,NO,BRAIN,DECEASED,NO,Untreated primary (de novo) GBM,YES,NO,null,TUMOR RESECTION,NO,NO,-28382,NO,0,20,,13,FEMALE,
TCGA-28-5207,,null,null,null,null,null,null,null,null,null,null,null,null,null,null,null,null,null,null,,null,,,,,null,
TCGA-15-1447,36,Brain,NO,NO,NO,NO,NO,YES,NO,BRAIN,LIVING,NO,Untreated primary (de novo) GBM,YES,NO,WITH TUMOR,TUMOR RESECTION,NO,NO,-13326,YES,0,,,1618,FEMALE,340
TCGA-06-0141,62,Brain,NO,NO,NO,NO,YES,YES,YES,BRAIN,DECEASED,NO,Untreated primary (de novo) GBM,YES,NO,WITH TUMOR,TUMOR RESECTION,NO,NO,-22925,YES,0,313,145,280,MALE,
TCGA-27-2518,52,Brain,NO,NO,NO,NO,YES,YES,NO,BRAIN,DECEASED,YES,Untreated primary (de novo) GBM,YES,NO,WITH TUMOR,TUMOR RESECTION,NO,NO,-19130,YES,0,752,538,752,MALE,
TCGA-32-1987,49,Brain,NO,NO,YES,NO,YES,YES,NO,BRAIN,DECEASED,NO,Untreated primary (de novo) GBM,YES,NO,WITH TUMOR,TUMOR RESECTION,NO,NO,-18091,YES,0,451,,451,FEMALE,67
TCGA-76-6192,,null,null,null,null,null,null,null,null,null,null,null,null,null,null,null,null,null,null,,null,,,,,null,
TCGA-06-0879,52,Brain,NO,NO,NO,NO,NO,YES,YES,BRAIN,LIVING,NO,Untreated primary (de novo) GBM,YES,NO,WITH TUMOR,TUMOR RESECTION,NO,NO,-19153,YES,0,,,699,MALE,699
TCGA-26-5136,78,Brain,null,null,null,null,null,null,null,BRAIN,LIVING,null,Untreated primary (de novo) GBM,YES,null,null,TUMOR RESECTION,NO,NO,-28496,null,0,,,37,FEMALE,
TCGA-02-0337,48,Brain,NO,NO,NO,NO,NO,YES,NO,BRAIN,DECEASED,NO,Untreated primary (de novo) GBM,YES,NO,WITH TUMOR,TUMOR RESECTION,NO,NO,-17642,YES,0,764,691,764,MALE,
TCGA-08-0358,50,Brain,NO,NO,NO,YES,YES,YES,YES,BRAIN,DECEASED,NO,Untreated primary (de novo) GBM,YES,YES,WITH TUMOR,TUMOR RESECTION,NO,NO,-18383,YES,0,678,,593,MALE,263
TCGA-08-0529,56,Brain,NO,NO,NO,YES,NO,YES,NO,BRAIN,DECEASED,NO,Untreated primary (de novo) GBM,YES,NO,WITH TUMOR,TUMOR RESECTION,NO,NO,-20556,YES,0,559,,526,FEMALE,328
TCGA-41-2575,75,Brain,NO,YES,YES,NO,NO,YES,NO,BRAIN,DECEASED,NO,Untreated primary (de novo) GBM,YES,NO,WITH TUMOR,EXCISIONAL BIOPSY,NO,NO,-27586,YES,0,290,131,290,MALE,
TCGA-14-1455,61,Brain,NO,NO,NO,NO,NO,NO,NO,BRAIN,DECEASED,YES,Untreated primary (de novo) GBM,YES,NO,WITH TUMOR,TUMOR RESECTION,NO,NO,-22562,YES,0,28,,28,MALE,
TCGA-06-0179,64,Brain,NO,YES,YES,YES,YES,YES,NO,BRAIN,DECEASED,NO,Untreated primary (de novo) GBM,YES,NO,WITH TUMOR,TUMOR RESECTION,NO,NO,-23449,YES,0,616,250,578,MALE,
TCGA-06-0166,51,Brain,NO,NO,NO,NO,YES,YES,NO,BRAIN,DECEASED,NO,Untreated primary (de novo) GBM,YES,NO,WITH TUMOR,TUMOR RESECTION,NO,NO,-18902,YES,0,178,66,161,MALE,
TCGA-08-0514,69,Brain,NO,NO,NO,NO,NO,YES,NO,BRAIN,DECEASED,NO,Untreated primary (de novo) GBM,YES,NO,WITH TUMOR,TUMOR RESECTION,NO,NO,-25457,NO,0,337,,259,FEMALE,
TCGA-06-0197,65,Brain,NO,NO,NO,NO,NO,NO,NO,BRAIN,DECEASED,NO,Untreated primary (de novo) GBM,YES,NO,WITH TUMOR,TUMOR RESECTION,NO,NO,-24095,YES,0,168,47,79,FEMALE,
TCGA-28-5204,,null,null,null,null,null,null,null,null,null,null,null,null,null,null,null,null,null,null,,null,,,,,null,
TCGA-08-0355,30,Brain,NO,NO,YES,NO,YES,YES,YES,BRAIN,DECEASED,NO,Untreated primary (de novo) GBM,YES,NO,WITH TUMOR,TUMOR RESECTION,NO,NO,-11098,YES,0,747,,685,FEMALE,519
TCGA-06-0878,74,Brain,NO,NO,NO,NO,YES,YES,NO,BRAIN,LIVING,NO,Untreated primary (de novo) GBM,YES,NO,WITH TUMOR,TUMOR RESECTION,NO,NO,-27319,YES,0,,,218,MALE,66
TCGA-28-1747,44,Brain,NO,NO,NO,NO,NO,YES,NO,BRAIN,DECEASED,NO,Untreated primary (de novo) GBM,YES,NO,null,FINE NEEDLE ASPIRATION BIOPSY,NO,NO,-16301,YES,0,77,,77,MALE,
TCGA-06-2558,75,Brain,NO,YES,NO,NO,NO,YES,null,BRAIN,DECEASED,null,Untreated primary (de novo) GBM,YES,null,null,TUMOR RESECTION,NO,NO,-27511,null,0,380,,23,FEMALE,
TCGA-12-1090,58,Brain,NO,YES,NO,NO,YES,YES,NO,BRAIN,DECEASED,NO,Untreated primary (de novo) GBM,YES,NO,WITH TUMOR,EXCISIONAL BIOPSY,NO,NO,-21377,YES,0,230,,189,MALE,
TCGA-12-0820,40,Brain,YES,NO,YES,NO,YES,YES,YES,BRAIN,DECEASED,YES,Untreated primary (de novo) GBM,YES,NO,WITH TUMOR,EXCISIONAL BIOPSY,NO,NO,-14877,YES,0,562,,562,MALE,272
TCGA-06-2561,53,Brain,NO,NO,NO,NO,YES,YES,NO,BRAIN,LIVING,NO,Untreated primary (de novo) GBM,YES,NO,WITH TUMOR,TUMOR RESECTION,NO,NO,-19504,YES,0,,,282,FEMALE,78
TCGA-27-2523,63,Brain,NO,NO,NO,NO,NO,YES,NO,BRAIN,DECEASED,YES,Untreated primary (de novo) GBM,YES,NO,WITH TUMOR,TUMOR RESECTION,NO,NO,-23034,YES,0,489,402,489,MALE,
TCGA-12-0821,62,Brain,NO,NO,NO,NO,YES,YES,NO,BRAIN,DECEASED,NO,Untreated primary (de novo) GBM,YES,NO,WITH TUMOR,EXCISIONAL BIOPSY,NO,NO,-22949,YES,0,323,,323,MALE,259
TCGA-08-0346,69,Brain,NO,NO,NO,NO,NO,YES,NO,BRAIN,DECEASED,NO,Untreated primary (de novo) GBM,YES,NO,WITH TUMOR,TUMOR RESECTION,NO,NO,-25409,YES,0,256,75,132,MALE,
TCGA-12-1088,53,Brain,NO,NO,NO,NO,NO,YES,NO,BRAIN,DECEASED,NO,Untreated primary (de novo) GBM,YES,NO,null,TUMOR RESECTION,NO,NO,-19667,YES,0,3880,,3880,FEMALE,
TCGA-06-0192,58,Brain,NO,NO,NO,NO,NO,YES,NO,BRAIN,LIVING,NO,Untreated primary (de novo) GBM,YES,NO,TUMOR FREE,TUMOR RESECTION,NO,NO,-21243,YES,0,,,556,MALE,
TCGA-26-1440,48,Brain,NO,NO,NO,NO,NO,YES,NO,BRAIN,LIVING,NO,Untreated primary (de novo) GBM,YES,NO,WITH TUMOR,TUMOR RESECTION,NO,NO,-17683,YES,0,,,296,MALE,233
TCGA-02-0080,28,Brain,NO,NO,NO,NO,YES,YES,NO,BRAIN,DECEASED,NO,Untreated primary (de novo) GBM,YES,NO,WITH TUMOR,TUMOR RESECTION,NO,YES,-10309,YES,0,2729,2339,2729,MALE,
TCGA-08-0375,51,Brain,NO,YES,NO,NO,NO,YES,NO,BRAIN,DECEASED,NO,Untreated primary (de novo) GBM,YES,NO,WITH TUMOR,EXCISIONAL BIOPSY,YES,NO,-18941,NO,0,372,,279,FEMALE,161
TCGA-12-0619,60,Brain,NO,NO,YES,NO,YES,YES,YES,BRAIN,DECEASED,NO,Untreated primary (de novo) GBM,YES,NO,WITH TUMOR,EXCISIONAL BIOPSY,NO,NO,-21920,YES,0,1062,203,316,MALE,
TCGA-08-0518,60,Brain,null,null,null,null,null,YES,NO,BRAIN,DECEASED,NO,Untreated primary (de novo) GBM,YES,NO,WITH TUMOR,TUMOR RESECTION,NO,NO,-21995,NO,0,588,134,39,FEMALE,
TCGA-16-1460,36,Brain,NO,null,NO,NO,null,YES,NO,BRAIN,LIVING,NO,Untreated primary (de novo) GBM,YES,NO,null,TUMOR RESECTION,YES,NO,-13207,YES,0,,,195,FEMALE,
TCGA-27-2526,79,Brain,NO,NO,NO,NO,NO,NO,NO,BRAIN,DECEASED,YES,Untreated primary (de novo) GBM,YES,NO,WITH TUMOR,TUMOR RESECTION,NO,NO,-28976,NO,0,87,,87,FEMALE,
TCGA-06-0646,60,Brain,NO,NO,NO,NO,NO,YES,NO,BRAIN,DECEASED,NO,Untreated primary (de novo) GBM,YES,NO,WITH TUMOR,TUMOR RESECTION,NO,NO,-22272,YES,0,175,90,136,MALE,
TCGA-08-0380,74,Brain,NO,NO,YES,NO,YES,YES,YES,BRAIN,DECEASED,NO,Untreated primary (de novo) GBM,YES,NO,WITH TUMOR,TUMOR RESECTION,NO,NO,-27277,NO,0,454,151,330,FEMALE,
TCGA-06-0644,71,Brain,NO,YES,YES,NO,YES,YES,NO,BRAIN,LIVING,NO,Untreated primary (de novo) GBM,YES,NO,WITH TUMOR,TUMOR RESECTION,NO,NO,-26246,YES,0,,,375,MALE,85
TCGA-28-1756,78,Brain,NO,NO,NO,NO,NO,YES,NO,BRAIN,LIVING,NO,Untreated primary (de novo) GBM,YES,YES,TUMOR FREE,TUMOR RESECTION,NO,NO,-28648,YES,0,,,86,MALE,
TCGA-16-0850,52,Brain,NO,NO,NO,NO,NO,YES,NO,BRAIN,DECEASED,NO,Untreated primary (de novo) GBM,YES,NO,WITH TUMOR,TUMOR RESECTION,NO,NO,-19281,YES,0,498,,496,FEMALE,83
TCGA-08-0389,59,Brain,null,null,null,null,null,YES,YES,BRAIN,DECEASED,NO,Untreated primary (de novo) GBM,YES,NO,WITH TUMOR,TUMOR RESECTION,NO,NO,-21638,YES,0,467,,97,MALE,
TCGA-06-0155,61,Brain,NO,NO,NO,NO,YES,YES,YES,BRAIN,DECEASED,NO,Untreated primary (de novo) GBM,YES,NO,WITH TUMOR,TUMOR RESECTION,NO,NO,-22497,NO,0,318,256,263,MALE,
TCGA-06-0397,57,Brain,NO,YES,NO,NO,YES,YES,NO,BRAIN,DECEASED,NO,Untreated primary (de novo) GBM,YES,NO,WITH TUMOR,TUMOR RESECTION,NO,NO,-20997,YES,0,121,,15,FEMALE,
TCGA-32-4719,73,Brain,NO,NO,NO,NO,NO,YES,NO,BRAIN,DECEASED,NO,Untreated primary (de novo) GBM,YES,NO,WITH TUMOR,TUMOR RESECTION,NO,NO,-26691,YES,0,330,,330,MALE,
TCGA-02-0060,66,Brain,NO,NO,NO,NO,NO,YES,NO,BRAIN,DECEASED,NO,Untreated primary (de novo) GBM,YES,NO,WITH TUMOR,TUMOR RESECTION,NO,NO,-24150,YES,0,183,183,183,FEMALE,
TCGA-12-1099,68,Brain,NO,YES,YES,NO,YES,YES,YES,BRAIN,DECEASED,NO,Untreated primary (de novo) GBM,YES,NO,WITH TUMOR,EXCISIONAL BIOPSY,NO,NO,-25034,YES,0,125,,103,FEMALE,62
TCGA-02-0064,50,Brain,NO,NO,NO,NO,YES,YES,NO,BRAIN,DECEASED,NO,Untreated primary (de novo) GBM,YES,NO,WITH TUMOR,TUMOR RESECTION,NO,NO,-18280,YES,0,600,,600,MALE,496
TCGA-32-4209,40,Brain,NO,null,null,null,null,YES,NO,BRAIN,LIVING,NO,Treated primary GBM,YES,NO,WITH TUMOR,TUMOR RESECTION,YES,NO,-14903,YES,0,,,338,MALE,93
TCGA-02-0004,59,Brain,NO,NO,NO,NO,NO,YES,NO,BRAIN,DECEASED,NO,Untreated primary (de novo) GBM,YES,NO,WITH TUMOR,TUMOR RESECTION,NO,NO,-21617,YES,0,345,314,345,MALE,
TCGA-12-0829,75,Brain,NO,NO,NO,YES,YES,YES,YES,BRAIN,DECEASED,NO,Untreated primary (de novo) GBM,YES,YES,WITH TUMOR,EXCISIONAL BIOPSY,NO,NO,-27470,YES,0,626,,626,MALE,473
TCGA-06-0188,71,Brain,NO,NO,YES,NO,NO,YES,NO,BRAIN,LIVING,NO,Untreated primary (de novo) GBM,YES,NO,WITH TUMOR,TUMOR RESECTION,NO,NO,-26079,YES,0,,,866,MALE,
TCGA-02-0015,50,Brain,NO,NO,NO,NO,YES,YES,NO,BRAIN,DECEASED,NO,Untreated primary (de novo) GBM,YES,NO,WITH TUMOR,TUMOR RESECTION,NO,NO,-18404,YES,0,627,,627,MALE,456
TCGA-02-0317,40,Brain,NO,NO,NO,NO,null,YES,NO,BRAIN,DECEASED,NO,Untreated primary (de novo) GBM,YES,NO,WITH TUMOR,TUMOR RESECTION,NO,NO,-14636,YES,0,372,238,372,MALE,
TCGA-28-5214,,null,null,null,null,null,null,null,null,null,null,null,null,null,null,null,null,null,null,,null,,,,,null,
TCGA-02-0111,56,Brain,NO,NO,NO,NO,null,YES,NO,BRAIN,DECEASED,NO,Untreated primary (de novo) GBM,YES,NO,WITH TUMOR,TUMOR RESECTION,NO,NO,-20813,YES,0,704,74,704,MALE,
TCGA-06-2569,24,Brain,NO,NO,NO,NO,NO,null,null,BRAIN,LIVING,null,Untreated primary (de novo) GBM,YES,null,WITH TUMOR,TUMOR RESECTION,NO,NO,-8921,null,0,,,13,FEMALE,
TCGA-02-2466,61,null,NO,NO,NO,NO,YES,YES,NO,BRAIN,DECEASED,NO,Treated primary GBM,YES,NO,WITH TUMOR,EXCISIONAL BIOPSY,NO,NO,-22456,YES,0,511,128,511,MALE,
TCGA-14-3476,74,Brain,NO,NO,NO,NO,NO,NO,NO,BRAIN,DECEASED,YES,Untreated primary (de novo) GBM,YES,NO,null,TUMOR RESECTION,NO,NO,-27172,NO,0,12,9,12,MALE,
TCGA-02-0037,74,Brain,NO,NO,NO,NO,NO,YES,NO,BRAIN,DECEASED,NO,Untreated primary (de novo) GBM,YES,NO,WITH TUMOR,TUMOR RESECTION,NO,NO,-27063,NO,0,109,37,109,FEMALE,
TCGA-32-2494,58,Brain,NO,YES,NO,NO,YES,YES,NO,BRAIN,DECEASED,NO,Untreated primary (de novo) GBM,YES,NO,WITH TUMOR,TUMOR RESECTION,NO,NO,-21198,YES,0,632,488,632,FEMALE,
TCGA-27-2519,48,Brain,NO,NO,NO,NO,YES,YES,NO,BRAIN,LIVING,YES,Untreated primary (de novo) GBM,YES,NO,WITH TUMOR,TUMOR RESECTION,NO,NO,-17715,YES,0,,256,316,MALE,
TCGA-08-0354,52,Brain,NO,NO,YES,NO,YES,YES,NO,BRAIN,DECEASED,NO,Untreated primary (de novo) GBM,YES,NO,WITH TUMOR,TUMOR RESECTION,NO,NO,-19198,YES,0,546,253,458,FEMALE,
TCGA-12-0692,75,Brain,NO,NO,NO,NO,NO,NO,NO,BRAIN,DECEASED,NO,Untreated primary (de novo) GBM,YES,NO,WITH TUMOR,EXCISIONAL BIOPSY,NO,NO,-27519,YES,0,111,35,80,FEMALE,
TCGA-19-2619,55,Brain,NO,NO,NO,NO,YES,YES,NO,BRAIN,LIVING,NO,Untreated primary (de novo) GBM,YES,NO,WITH TUMOR,TUMOR RESECTION,YES,NO,-20158,YES,0,,146,294,FEMALE,
TCGA-06-0238,46,Brain,NO,NO,NO,NO,NO,YES,NO,BRAIN,DECEASED,NO,Untreated primary (de novo) GBM,YES,NO,WITH TUMOR,TUMOR RESECTION,NO,NO,-17037,YES,0,404,311,359,MALE,
TCGA-08-0386,74,Brain,NO,NO,NO,YES,NO,YES,YES,BRAIN,DECEASED,NO,Untreated primary (de novo) GBM,YES,NO,WITH TUMOR,TUMOR RESECTION,NO,NO,-27053,YES,0,548,,478,MALE,427
TCGA-02-0021,43,Brain,NO,NO,NO,NO,NO,YES,NO,BRAIN,DECEASED,NO,Untreated primary (de novo) GBM,YES,NO,WITH TUMOR,TUMOR RESECTION,NO,YES,-16035,YES,0,2361,254,2361,FEMALE,
TCGA-02-0070,71,Brain,NO,NO,NO,NO,NO,YES,NO,BRAIN,LIVING,NO,Untreated primary (de novo) GBM,YES,NO,WITH TUMOR,TUMOR RESECTION,NO,NO,-25916,YES,0,,,762,MALE,762
TCGA-06-0145,53,Brain,NO,NO,NO,NO,NO,NO,NO,BRAIN,DECEASED,NO,Untreated primary (de novo) GBM,YES,NO,WITH TUMOR,TUMOR RESECTION,NO,NO,-19660,YES,0,71,,71,FEMALE,
TCGA-06-0675,,null,null,null,null,null,null,null,null,null,null,null,null,YES,null,null,null,null,null,,null,,,,,null,
TCGA-02-0069,31,Brain,NO,NO,NO,NO,NO,YES,NO,BRAIN,LIVING,NO,Untreated primary (de novo) GBM,YES,NO,WITH TUMOR,TUMOR RESECTION,NO,NO,-11668,YES,0,,873,873,FEMALE,
TCGA-06-0169,68,Brain,NO,NO,NO,NO,NO,YES,NO,BRAIN,DECEASED,NO,Untreated primary (de novo) GBM,YES,NO,WITH TUMOR,TUMOR RESECTION,NO,NO,-25127,YES,0,100,92,95,MALE,
TCGA-06-5413,67,Brain,NO,NO,YES,NO,NO,YES,NO,BRAIN,LIVING,NO,Untreated primary (de novo) GBM,YES,NO,WITH TUMOR,TUMOR RESECTION,NO,NO,-24477,YES,0,,195,268,MALE,
TCGA-12-0707,55,Brain,null,null,null,null,null,null,null,BRAIN,DECEASED,null,Untreated primary (de novo) GBM,YES,null,null,EXCISIONAL BIOPSY,NO,NO,-20136,null,0,863,,0,MALE,
TCGA-02-0075,63,Brain,NO,NO,NO,NO,NO,YES,NO,BRAIN,DECEASED,NO,Untreated primary (de novo) GBM,YES,NO,WITH TUMOR,TUMOR RESECTION,NO,NO,-23205,YES,0,634,336,634,MALE,
TCGA-19-2631,74,Brain,NO,NO,NO,NO,NO,YES,NO,BRAIN,DECEASED,NO,Untreated primary (de novo) GBM,YES,NO,TUMOR FREE,TUMOR RESECTION,NO,NO,-27199,NO,0,213,,213,FEMALE,
TCGA-02-0046,61,Brain,NO,NO,NO,NO,null,YES,NO,BRAIN,DECEASED,NO,Untreated primary (de novo) GBM,YES,NO,WITH TUMOR,TUMOR RESECTION,NO,NO,-22417,null,0,208,194,208,MALE,
TCGA-06-2565,59,Brain,NO,YES,NO,NO,YES,YES,NO,BRAIN,LIVING,NO,Untreated primary (de novo) GBM,YES,NO,WITH TUMOR,TUMOR RESECTION,NO,NO,-21559,YES,0,,178,207,MALE,
TCGA-14-1037,66,Brain,YES,NO,YES,NO,YES,YES,YES,BRAIN,DECEASED,YES,Untreated primary (de novo) GBM,YES,NO,WITH TUMOR,TUMOR RESECTION,NO,NO,-24425,YES,0,587,,587,FEMALE,326
TCGA-12-0828,57,Brain,NO,NO,NO,NO,NO,YES,NO,BRAIN,DECEASED,NO,Untreated primary (de novo) GBM,YES,NO,WITH TUMOR,EXCISIONAL BIOPSY,NO,NO,-20909,YES,0,271,13,271,MALE,
TCGA-02-0107,56,Brain,NO,NO,NO,NO,null,YES,NO,BRAIN,DECEASED,NO,Treated primary GBM,YES,NO,WITH TUMOR,TUMOR RESECTION,NO,YES,-20557,YES,0,537,,537,MALE,146
TCGA-16-0848,57,Brain,NO,NO,NO,NO,YES,YES,NO,BRAIN,DECEASED,NO,Untreated primary (de novo) GBM,YES,NO,WITH TUMOR,TUMOR RESECTION,NO,NO,-20847,YES,0,535,,302,MALE,129
TCGA-32-1977,63,Brain,null,null,null,null,null,null,null,BRAIN,LIVING,null,Untreated primary (De Nova) GBM,YES,null,WITH TUMOR,TUMOR RESECTION,NO,NO,-23205,null,0,,,3,FEMALE,
TCGA-06-0414,63,Brain,NO,NO,NO,NO,NO,YES,NO,BRAIN,DECEASED,NO,Untreated primary (de novo) GBM,YES,NO,TUMOR FREE,TUMOR RESECTION,NO,NO,-23215,YES,0,1068,,1065,MALE,1013
TCGA-12-5295,60,Brain,NO,NO,NO,NO,NO,YES,YES,BRAIN,DECEASED,NO,Untreated primary (de novo) GBM,YES,NO,WITH TUMOR,TUMOR RESECTION,NO,NO,-22161,YES,0,453,398,398,FEMALE,
TCGA-14-1034,60,Brain,YES,NO,NO,NO,YES,YES,NO,BRAIN,DECEASED,YES,Untreated primary (de novo) GBM,YES,NO,WITH TUMOR,TUMOR RESECTION,NO,NO,-22028,NO,0,485,274,485,FEMALE,
TCGA-27-1836,33,Brain,NO,NO,NO,NO,YES,YES,NO,BRAIN,DECEASED,YES,Untreated primary (de novo) GBM,YES,NO,WITH TUMOR,TUMOR RESECTION,NO,NO,-12060,YES,0,914,172,914,FEMALE,
TCGA-06-0216,61,Brain,NO,YES,NO,NO,YES,YES,NO,BRAIN,DECEASED,NO,Untreated primary (de novo) GBM,YES,NO,WITH TUMOR,TUMOR RESECTION,NO,NO,-22524,NO,0,735,175,684,FEMALE,
TCGA-08-0385,71,Brain,NO,NO,NO,NO,NO,null,null,BRAIN,DECEASED,null,Untreated primary (de novo) GBM,YES,null,WITH TUMOR,TUMOR RESECTION,NO,NO,-26233,null,0,82,,31,MALE,
TCGA-81-5910,,null,null,null,null,null,null,null,null,null,null,null,null,null,null,null,null,null,null,,null,,,,,null,
TCGA-19-0957,48,Brain,NO,NO,NO,NO,YES,YES,NO,BRAIN,DECEASED,NO,Untreated primary (de novo) GBM,YES,NO,WITH TUMOR,TUMOR RESECTION,NO,NO,-17714,YES,0,665,,665,FEMALE,50
TCGA-27-2521,34,Brain,NO,NO,NO,NO,NO,YES,NO,BRAIN,LIVING,YES,Untreated primary (de novo) GBM,YES,NO,WITH TUMOR,TUMOR RESECTION,NO,NO,-12685,YES,0,,,316,MALE,
TCGA-19-5954,,null,null,null,null,null,null,null,null,null,null,null,null,null,null,null,null,null,null,,null,,,,,null,
TCGA-02-2483,43,null,NO,NO,NO,NO,NO,YES,NO,BRAIN,LIVING,NO,Untreated primary (de novo) GBM,YES,NO,WITH TUMOR,EXCISIONAL BIOPSY,NO,NO,-15964,YES,0,,,465,MALE,
TCGA-28-2513,69,Brain,NO,YES,NO,NO,YES,YES,NO,BRAIN,LIVING,NO,Untreated primary (de novo) GBM,YES,NO,WITH TUMOR,TUMOR RESECTION,NO,NO,-25420,YES,0,,75,222,FEMALE,
TCGA-32-2491,63,Brain,NO,NO,NO,NO,YES,YES,NO,BRAIN,DECEASED,NO,Untreated primary (de novo) GBM,YES,NO,WITH TUMOR,TUMOR RESECTION,NO,NO,-23130,YES,0,372,,372,MALE,70
TCGA-02-0260,54,Brain,NO,NO,NO,NO,null,YES,NO,BRAIN,DECEASED,NO,Untreated primary (de novo) GBM,YES,NO,WITH TUMOR,TUMOR RESECTION,NO,NO,-19956,null,0,514,,514,MALE,
TCGA-19-0963,61,Brain,NO,NO,NO,NO,NO,YES,NO,BRAIN,DECEASED,NO,Untreated primary (de novo) GBM,YES,NO,WITH TUMOR,TUMOR RESECTION,NO,NO,-22325,YES,0,434,,434,MALE,310
TCGA-12-5301,59,Brain,NO,NO,NO,NO,NO,YES,NO,BRAIN,DECEASED,NO,Untreated primary (de novo) GBM,YES,NO,WITH TUMOR,TUMOR RESECTION,NO,NO,-21768,YES,0,61,,61,MALE,
TCGA-41-2572,67,Brain,NO,NO,YES,NO,NO,YES,NO,BRAIN,DECEASED,NO,Untreated primary (de novo) GBM,YES,NO,WITH TUMOR,EXCISIONAL BIOPSY,NO,NO,-24505,YES,0,406,122,406,MALE,
TCGA-06-0164,47,Brain,NO,NO,YES,NO,YES,YES,NO,BRAIN,DECEASED,NO,Untreated primary (de novo) GBM,YES,NO,WITH TUMOR,TUMOR RESECTION,NO,NO,-17510,YES,0,1730,1428,1729,MALE,
TCGA-12-0618,49,Brain,NO,NO,NO,NO,NO,YES,NO,BRAIN,DECEASED,NO,Untreated primary (de novo) GBM,YES,NO,null,EXCISIONAL BIOPSY,NO,NO,-18071,YES,0,394,,49,MALE,
TCGA-06-1087,75,Brain,NO,NO,NO,NO,NO,YES,NO,BRAIN,DECEASED,NO,Untreated primary (de novo) GBM,YES,NO,WITH TUMOR,TUMOR RESECTION,NO,NO,-27657,YES,0,123,,109,MALE,109
TCGA-06-5858,,null,null,null,null,null,null,null,null,null,null,null,null,null,null,null,null,null,null,,null,,,,,null,
TCGA-76-4926,,null,null,null,null,null,null,null,null,null,null,null,null,null,null,null,null,null,null,,null,,,,,null,
TCGA-19-5956,,null,null,null,null,null,null,null,null,null,null,null,null,null,null,null,null,null,null,,null,,,,,null,
TCGA-08-0625,,null,null,null,null,null,null,null,null,null,null,null,null,YES,null,null,null,null,null,,null,,,,,null,
TCGA-32-4210,73,Brain,null,NO,NO,NO,NO,null,null,BRAIN,DECEASED,NO,Untreated primary (De Nova) GBM,YES,NO,WITH TUMOR,TUMOR RESECTION,NO,NO,-26768,null,0,112,,112,MALE,
TCGA-06-2567,65,Brain,NO,NO,NO,NO,NO,YES,NO,BRAIN,DECEASED,NO,Untreated primary (de novo) GBM,YES,NO,WITH TUMOR,TUMOR RESECTION,NO,NO,-23759,YES,0,133,,133,MALE,
TCGA-02-0052,49,Brain,NO,NO,NO,NO,NO,YES,NO,BRAIN,DECEASED,NO,Untreated primary (de novo) GBM,YES,NO,WITH TUMOR,TUMOR RESECTION,NO,NO,-18060,YES,0,383,204,383,MALE,
TCGA-06-0137,63,Brain,NO,NO,NO,NO,YES,YES,NO,BRAIN,DECEASED,NO,Untreated primary (de novo) GBM,YES,NO,WITH TUMOR,TUMOR RESECTION,NO,NO,-23273,YES,0,812,487,701,FEMALE,
TCGA-27-1835,53,Brain,NO,NO,NO,NO,YES,YES,NO,BRAIN,DECEASED,YES,Untreated primary (de novo) GBM,YES,NO,WITH TUMOR,TUMOR RESECTION,NO,NO,-19443,YES,0,648,157,648,FEMALE,
TCGA-28-5215,,null,null,null,null,null,null,null,null,null,null,null,null,null,null,null,null,null,null,,null,,,,,null,
TCGA-06-0143,58,Brain,NO,NO,YES,NO,NO,YES,YES,BRAIN,DECEASED,NO,Untreated primary (de novo) GBM,YES,NO,WITH TUMOR,TUMOR RESECTION,NO,NO,-21386,YES,0,357,,357,MALE,264
TCGA-26-5135,72,Brain,null,null,null,null,null,null,null,BRAIN,DECEASED,null,Untreated primary (de novo) GBM,YES,null,null,TUMOR RESECTION,NO,NO,-26490,null,0,269,,269,FEMALE,
TCGA-32-1970,59,Brain,NO,NO,NO,NO,NO,YES,NO,BRAIN,DECEASED,NO,Untreated primary (de novo) GBM,YES,NO,WITH TUMOR,TUMOR RESECTION,NO,NO,-21613,YES,0,467,408,467,MALE,
TCGA-28-2499,,null,null,null,null,null,null,null,null,null,null,null,null,YES,null,null,null,null,null,,null,,,,,null,
TCGA-06-6390,,null,null,null,null,null,null,null,null,null,null,null,null,null,null,null,null,null,null,,null,,,,,null,
TCGA-19-1788,39,Brain,NO,NO,NO,NO,NO,NO,NO,BRAIN,DECEASED,NO,Untreated primary (de novo) GBM,YES,NO,null,TUMOR RESECTION,NO,NO,-14301,NO,0,111,,111,MALE,
TCGA-28-1749,73,Brain,NO,NO,NO,NO,NO,YES,NO,BRAIN,LIVING,NO,Untreated primary (de novo) GBM,YES,NO,WITH TUMOR,TUMOR RESECTION,NO,NO,-26765,YES,0,,279,279,MALE,
TCGA-12-0778,53,Brain,NO,YES,YES,NO,YES,YES,YES,BRAIN,DECEASED,NO,Untreated primary (de novo) GBM,YES,NO,WITH TUMOR,EXCISIONAL BIOPSY,NO,NO,-19460,YES,0,453,231,451,MALE,
TCGA-28-1755,52,Brain,null,null,null,null,null,YES,NO,BRAIN,DECEASED,NO,Untreated primary (de novo) GBM,YES,NO,WITH TUMOR,TUMOR RESECTION,NO,NO,-19263,YES,0,46,,46,FEMALE,
TCGA-02-0326,82,Brain,NO,NO,NO,NO,null,YES,NO,BRAIN,DECEASED,NO,Untreated primary (de novo) GBM,YES,NO,WITH TUMOR,TUMOR RESECTION,NO,NO,-30159,null,0,223,5,374,FEMALE,
TCGA-02-0290,49,Brain,NO,NO,NO,NO,NO,YES,NO,BRAIN,DECEASED,NO,Untreated primary (de novo) GBM,YES,NO,WITH TUMOR,TUMOR RESECTION,NO,NO,-18066,YES,0,485,374,485,MALE,
TCGA-12-1097,61,Brain,NO,NO,YES,NO,YES,YES,YES,BRAIN,DECEASED,NO,Untreated primary (de novo) GBM,YES,NO,WITH TUMOR,EXCISIONAL BIOPSY,NO,NO,-22526,YES,0,442,166,442,MALE,
TCGA-02-0007,40,Brain,NO,YES,NO,NO,NO,YES,NO,BRAIN,DECEASED,NO,Treated primary GBM,YES,NO,WITH TUMOR,TUMOR RESECTION,NO,YES,-14805,YES,0,705,518,705,FEMALE,
TCGA-19-1388,58,Brain,NO,NO,NO,NO,YES,YES,NO,BRAIN,DECEASED,NO,Untreated primary (de novo) GBM,YES,NO,WITH TUMOR,TUMOR RESECTION,NO,NO,-21367,YES,0,394,148,394,MALE,
TCGA-14-1829,57,Brain,NO,NO,NO,NO,NO,YES,NO,BRAIN,LIVING,YES,Untreated primary (de novo) GBM,YES,NO,WITH TUMOR,TUMOR RESECTION,NO,NO,-20929,YES,0,,,217,MALE,
TCGA-32-2498,5,Brain,null,NO,NO,NO,NO,NO,NO,BRAIN,LIVING,NO,Untreated primary (De Nova) GBM,YES,NO,WITH TUMOR,TUMOR RESECTION,NO,NO,-2047,NO,0,,,818,FEMALE,
TCGA-76-4931,,null,null,null,null,null,null,null,null,null,null,null,null,null,null,null,null,null,null,,null,,,,,null,
TCGA-27-1832,59,Brain,NO,NO,NO,NO,YES,YES,NO,BRAIN,DECEASED,YES,Untreated primary (de novo) GBM,YES,NO,WITH TUMOR,TUMOR RESECTION,NO,NO,-21677,YES,0,300,183,0,FEMALE,
TCGA-28-2510,,null,null,null,null,null,null,null,null,null,null,null,null,null,null,null,null,null,null,,null,,,,,null,
TCGA-32-4208,25,Brain,NO,NO,NO,NO,NO,YES,NO,BRAIN,LIVING,NO,Untreated primary (de novo) GBM,YES,NO,WITH TUMOR,TUMOR RESECTION,NO,NO,-9213,YES,0,,,400,MALE,
TCGA-02-0422,50,Brain,NO,NO,NO,NO,null,YES,NO,BRAIN,DECEASED,NO,Untreated primary (de novo) GBM,YES,NO,WITH TUMOR,TUMOR RESECTION,NO,NO,-18367,YES,0,441,125,441,MALE,
TCGA-06-5408,54,Brain,NO,NO,NO,NO,NO,YES,NO,BRAIN,DECEASED,NO,Untreated primary (de novo) GBM,YES,NO,WITH TUMOR,TUMOR RESECTION,NO,NO,-20063,YES,0,356,157,341,FEMALE,
TCGA-12-0822,46,Brain,NO,NO,YES,NO,YES,YES,YES,BRAIN,DECEASED,NO,Untreated primary (de novo) GBM,YES,NO,WITH TUMOR,EXCISIONAL BIOPSY,NO,NO,-16803,YES,0,715,,715,MALE,91
TCGA-32-1976,65,Brain,NO,NO,NO,NO,NO,NO,NO,BRAIN,DECEASED,NO,Untreated primary (de novo) GBM,YES,NO,null,TUMOR RESECTION,NO,NO,-23798,NO,0,15,,15,MALE,
TCGA-06-0649,73,Brain,NO,NO,NO,NO,NO,NO,NO,BRAIN,DECEASED,NO,Untreated primary (de novo) GBM,YES,NO,WITH TUMOR,TUMOR RESECTION,NO,NO,-26796,NO,0,64,,62,FEMALE,
TCGA-08-0521,17,Brain,NO,NO,NO,NO,NO,YES,NO,BRAIN,DECEASED,NO,Untreated primary (de novo) GBM,YES,NO,WITH TUMOR,TUMOR RESECTION,NO,NO,-6376,YES,0,146,125,146,MALE,
TCGA-12-0657,69,Brain,NO,NO,NO,NO,NO,NO,NO,BRAIN,DECEASED,NO,Untreated primary (de novo) GBM,YES,NO,WITH TUMOR,EXCISIONAL BIOPSY,NO,NO,-25413,NO,0,3,,3,MALE,