Subject ID,Image Series Identifier,Diffusion : No Image - no images or ADC provided,Cysts No,Cortical involvement No,Expansive T1~FLAIR Ratio,Satellites No,Thickness of the Enhancing Margin Thick/nodular (>3mm),Pial Invasion No,Calvarial Remodeling No,Proportion of Edema : 34-67%,Hemorrhage Yes,Proportion Enhancing : 6-33%,Focal,Proportion Necrosis : 34-67%,Deep WM Invasion None,Deep WM Invasion Corpus Callosum,Enhancing Tumor Crosses Midline Not Applicable (no CET),Enhancement Quality : Mark/Avid,Definition of the Enhancing Margin Well-defined,Definition of the Non-Enhancing Margin Well-defined,Ependymal Extension No,nCET Tumor Crosses Midline Not Applicable (No nCET),Proportion nCET : None (0%),Deep WM Invasion Internal Capsule,Diffusion : Facilitated,Ependymal Extension Yes,Cortical involvement Yes,Mixed T1<FLAIR Ratio,Enhancing Tumor Crosses Midline No,Proportion Necrosis : < 5%,Proportion nCET : 6-33%,Proportion Necrosis : 6-33%,Enhancing Tumor Crosses Midline Yes,Hemorrhage No,Proportion nCET : < 5%,nCET Tumor Crosses Midline Yes,Definition of the Non-Enhancing Margin Poorly-defined,Proportion of Edema : 6-33%,Thickness of the Enhancing Margin Solid,Proportion Enhancing : < 5%,Diffusion : Indeterminate,nCET Tumor Crosses Midline No,Gliomatosis,T1/FLAIR Ratio Not Applicable (No Flair),Pial Invasion Yes,Multifocal,Satellites Yes,Cortical involvement Indeterminate,Ependymal Extension Indeterminate,Satellites Indeterminate,Pial Invasion Indeterminate,Deep WM Invasion Indeterminate,Definition of the Enhancing Margin Indeterminate,Calvarial Remodeling Indeterminate,Enhancement Quality : Indeterminate,Multicentric,Enhancement Quality : Minimal/Mild,Definition of the Non-Enhancing Margin Indeterminate,nCET Tumor Crosses Midline Indeterminate,Proportion of Edema : None (0%),Proportion of Edema : 68%-95%,Cysts Yes,T1/FLAIR Ratio Indeterminate,Cysts Indeterminate,Proportion nCET : Indeterminate,Proportion Enhancing : Indeterminate,Proportion Necrosis : Indeterminate,Proportion Enhancing : 34-67%,Multifocal or Multicentric Indeterminate,Proportion of Edema : Indeterminate,Thickness of the Enhancing Margin Thin (<3mm),Infiltrative T1<<FLAIR Ratio,Definition of the Enhancing Margin Poorly-defined,Proportion nCET : 68%-95%,Deep WM Invasion Brainstem,Diffusion : Mixed,Hemorrhage Indeterminate,Proportion of Edema : < 5%,Proportion nCET : 34-67%,Enhancement Quality : None,Proportion Enhancing : None (0%),Enhancing Tumor Crosses Midline Indeterminate,Thickness of the Enhancing Margin Indeterminate,Proportion Enhancing : 68%- 95%,Calvarial Remodeling Yes,Diffusion : Restricted,Proportion Necrosis : None (0%),Definition of the Enhancing Margin Not Applicable,Thickness of the Enhancing Margin None,Subtype,CORE_sample,sil_width,Secondary or Recurrent,AgeAtFirstDiagnosis,MGMT_methylated,Survival (days),GENDER,TUMORTISSUESITE,KarnScore,VITALSTATUS,% Tumor Nuclei,% Necrosis
TCGA-06-0129,1.3.6.1.4.1.9328.50.45.9069737752249597180412180471261113388,,36,,90,,,115,135,,106,,13,,7,,,,11,71,120,,,,111,,126,,2,,,47,,,,,,,,55,,62,,,,,130,,,,,,,,,,68,,,,,,,,,,,,,,81,,,23,,,,29,,,,,,,,,,,,Proneural,CORE,0.266015396,No,31,Unmethlyated,1024,MALE,GBM,100,DEAD,97.5,0
TCGA-06-0166,1.3.6.1.4.1.9328.50.45.236385881105540723406863292408636742531,,,,,,,,,,,,,,,,,,,,,,,,,,,,,,,,,,,,,,,,,,,,,,,,,,,,,,,,,,,,,,,,,,,,,,,,,,,,,,,,,,,,,,,,,Proneural,CORE,0.170893483,No,52,Unmethlyated,178,MALE,GBM,,DEAD,92.5,30
TCGA-06-0646,1.3.6.1.4.1.9328.50.45.34346965014465065160645891558492461241,,,,,,,,,,,,,,,,,,,,,,,,,,,,,,,,,,,,,,,,,,,,,,,,,,,,,,,,,,,,,,,,,,,,,,,,,,,,,,,,,,,,,,,,,Proneural,CORE,0.051065952,No,61,Unmethlyated,175,MALE,GBM,90,DEAD,95,7.5
TCGA-06-0179,1.3.6.1.4.1.9328.50.45.229925037084238292303114803384540485800,,36,,,129,82,,135,31,106,56,13,,7,,,69,11,71,,,19,,,121,126,91,2,,,47,,,,,,,,,1133,62,,,116,,,,,,,,,,,,,,,,,,,,,,,,,,,,,,,,,,,,,,,,,,,,,Neural,CORE,0.213349878,No,64,Methylated,616,MALE,GBM,70,DEAD,90,5
TCGA-06-0132,1.3.6.1.4.1.9328.50.45.17296679150499502488628181564465958176,,,,,,,,,,,,,,,,,,,,,,,,,,,,,,,,,,,,,,,,,,,,,,,,,,,,,,,,,,,,,,,,,,,,,,,,,,,,,,,,,,,,,,,,,Neural,CORE,0.17579762,No,50,Unmethlyated,295,MALE,GBM,,ALIVE,97.5,2.5
TCGA-08-0380,1.3.6.1.4.1.9328.50.46.249932707077794018918613446127949293815,,,,,,,,,,,,,,,,,,,,,,,,,,,,,,,,,,,,,,,,,,,,,,,,,,,,,,,,,,,,,,,,,,,,,,,,,,,,,,,,,,,,,,,,,Neural,CORE,0.142134069,No,75,Unmethlyated,455,FEMALE,GBM,80,DEAD,100,2.5
TCGA-08-0357,1.3.6.1.4.1.9328.50.46.262710894696531450868984668624359091769,,,,,,,,,,,,,,,,,,,,,,,,,,,,,,,,,,,,,,,,,,,,,,,,,,,,,,,,,,,,,,,,,,,,,,,,,,,,,,,,,,,,,,,,,Classical,CORE,0.136163768,No,50,Unmethlyated,1143,MALE,GBM,,DEAD,95,7.5
TCGA-06-0175,1.3.6.1.4.1.9328.50.45.323740193304724211866226611014686495979,,,,,,,,,,,,,,,,,,,,,,,,,,,,,,,,,,,,,,,,,,,,,,,,,,,,,,,,,,,,,,,,,,,,,,,,,,,,,,,,,,,,,,,,,Mesenchymal,CORE,0.117554096,No,70,Unmethlyated,123,MALE,GBM,100,DEAD,90,0
TCGA-08-0524,1.3.6.1.4.1.9328.50.46.267971913863007998166877158233347638955,,,,,,,,,,,,,,,,,,,,,,,,,,,,,,,,,,,,,,,,,,,,,,,,,,,,,,,,,,,,,,,,,,,,,,,,,,,,,,,,,,,,,,,,,Proneural,CORE,0.397134204,No,18,Unmethlyated,221,FEMALE,GBM,,DEAD,90,10
TCGA-06-0214,1.3.6.1.4.1.9328.50.45.126220148683624769057288121342842968278,,,,,,,,,,,,,,,,,,,,,,,,,,,,,,,,,,,,,,,,,,,,,,,,,,,,,,,,,,,,,,,,,,,,,,,,,,,,,,,,,,,,,,,,,Neural,CORE,0.159942209,No,66,Methylated,457,MALE,GBM,40,DEAD,92.5,7.5
TCGA-06-0162,1.3.6.1.4.1.9328.50.45.37915160231361569367580436822191793480,,,,,,,,,,,,,,,,,,,,,,,,,,,,,,,,,,,,,,,,,,,,,,,,,,,,,,,,,,,,,,,,,,,,,,,,,,,,,,,,,,,,,,,,,Neural,CORE,0.29945534,No,47,Unmethlyated,97,FEMALE,GBM,60,DEAD,90,0
TCGA-08-0389,1.3.6.1.4.1.9328.50.46.35744345039794643107096013777654411542,,,,,,,,,,,,,,,,,,,,,,,,,,,,,,,,,,,,,,,,,,,,,,,,,,,,,,,,,,,,,,,,,,,,,,,,,,,,,,,,,,,,,,,,,Neural,NO,-0.052320938,No,59,Unmethlyated,467,MALE,GBM,,DEAD,95,0
TCGA-12-0616,,,,,,,,,,,,,,,,,,,,,,,,,,,,,,,,,,,,,,,,,,,,,,,,,,,,,,,,,,,,,,,,,,,,,,,,,,,,,,,,,,,,,,,,,,Proneural,CORE,0.221935128,No,37,Unmethlyated,448,FEMALE,GBM,100,DEAD,100,27.5
TCGA-06-0139,1.3.6.1.4.1.9328.50.45.293308685019652952105693162629851442849,,,,,,,,,,,,,,,,,,,,,,,,,,,,,,,,,,,,,,,,,,,,,,,,,,,,,,,,,,,,,,,,,,,,,,,,,,,,,,,,,,,,,,,,,Mesenchymal,CORE,0.406666929,No,40,Unmethlyated,362,MALE,GBM,60,DEAD,95,0
TCGA-06-0646,1.3.6.1.4.1.9328.50.45.301166976641182026552905919050101501421,,,,,,,,,,,,,,,,,,,,,,,,,,,,,,,,,,,,,,,,,,,,,,,,,,,,,,,,,,,,,,,,,,,,,,,,,,,,,,,,,,,,,,,,,Proneural,CORE,0.051065952,No,61,Unmethlyated,175,MALE,GBM,90,DEAD,95,7.5
TCGA-08-0389,1.3.6.1.4.1.9328.50.46.265467282136232588736256233486036181364,,,,,,,,,,,,,,,,,,,,,,,,,,,,,,,,,,,,,,,,,,,,,,,,,,,,,,,,,,,,,,,,,,,,,,,,,,,,,,,,,,,,,,,,,Neural,NO,-0.052320938,No,59,Unmethlyated,467,MALE,GBM,,DEAD,95,0
TCGA-06-0648,1.3.6.1.4.1.9328.50.45.46181378310705870060797560219773820302,,,,,,,,,,,,,,,,,,,,,,,,,,,,,,,,,,,,,,,,,,,,,,,,,,,,,,,,,,,,,,,,,,,,,,,,,,,,,,,,,,,,,,,,,Proneural,CORE,0.359617705,No,78,Methylated,77,MALE,GBM,90,ALIVE,100,10
TCGA-06-0143,1.3.6.1.4.1.9328.50.45.220406967991083904054827382062680917513,,,,,,,,,,,,,,,,,,,,,,,,,,,,,,,,,,,,,,,,,,,,,,,,,,,,,,,,,,,,,,,,,,,,,,,,,,,,,,,,,,,,,,,,,Mesenchymal,CORE,0.179468852,No,59,Unmethlyated,357,MALE,GBM,70,DEAD,82.5,37.5
TCGA-02-0006,,,,,,,,,,,,,,,,,,,,,,,,,,,,,,,,,,,,,,,,,,,,,,,,,,,,,,,,,,,,,,,,,,,,,,,,,,,,,,,,,,,,,,,,,,Mesenchymal,CORE,0.170480132,No,56,Unmethlyated,558,FEMALE,GBM,90,DEAD,100,7.5
TCGA-06-0137,1.3.6.1.4.1.9328.50.45.245032834513631066540411705422608325557,,,,,,,,,,,,,,,,,,,,,,,,,,,,,,,,,,,,,,,,,,,,,,,,,,,,,,,,,,,,,,,,,,,,,,,,,,,,,,,,,,,,,,,,,Classical,CORE,0.221526248,No,64,Unmethlyated,812,FEMALE,GBM,90,DEAD,92.5,2.5
TCGA-06-0132,1.3.6.1.4.1.9328.50.45.179662888459436689377957544239861695601,,,,,,,,,,,,,,,,,,,,,,,,,,,,,,,,,,,,,,,,,,,,,,,,,,,,,,,,,,,,,,,,,,,,,,,,,,,,,,,,,,,,,,,,,Neural,CORE,0.17579762,No,50,Unmethlyated,295,MALE,GBM,,ALIVE,97.5,2.5
TCGA-06-0137,1.3.6.1.4.1.9328.50.45.95719461710359976679826853913731119419,,,,,,,,,,,,,,,,,,,,,,,,,,,,,,,,,,,,,,,,,,,,,,,,,,,,,,,,,,,,,,,,,,,,,,,,,,,,,,,,,,,,,,,,,Classical,CORE,0.221526248,No,64,Unmethlyated,812,FEMALE,GBM,90,DEAD,92.5,2.5
TCGA-06-0178,1.3.6.1.4.1.9328.50.45.326333822258901477923978580324642008922,,,,,,,,,,,,,,,,,,,,,,,,,,,,,,,,,,,,,,,,,,,,,,,,,,,,,,,,,,,,,,,,,,,,,,,,,,,,,,,,,,,,,,,,,Neural,NO,-0.064188114,No,39,Unmethlyated,1168,MALE,GBM,,ALIVE,100,0
TCGA-08-0385,1.3.6.1.4.1.9328.50.46.321377862921249070587294748064327427456,,,,,,,,,,,,,,,,,,,,,,,,,,,,,,,,,,,,,,,,,,,,,,,,,,,,,,,,,,,,,,,,,,,,,,,,,,,,,,,,,,,,,,,,,Proneural,CORE,0.360735346,No,72,NA,82,MALE,GBM,,DEAD,100,7.5
TCGA-06-0175,1.3.6.1.4.1.9328.50.45.332198392917983887866042069159398539079,110,36,,,129,82,,135,31,,56,13,,7,,,69,11,71,120,,19,,,,126,91,2,46,,,,105,,,,,,,,62,,,116,,,,,,,,,,,,,,,,,,,,,,,,,,,,,,,,,,,,,,,,,,,,,Mesenchymal,CORE,0.117554096,No,70,Unmethlyated,123,MALE,GBM,100,DEAD,90,0
TCGA-06-0214,1.3.6.1.4.1.9328.50.45.178662956038879287134765587165784838807,,,,,,,,,,,,,,,,,,,,,,,,,,,,,,,,,,,,,,,,,,,,,,,,,,,,,,,,,,,,,,,,,,,,,,,,,,,,,,,,,,,,,,,,,Neural,CORE,0.159942209,No,66,Methylated,457,MALE,GBM,40,DEAD,92.5,7.5
TCGA-02-0269,,,,,,,,,,,,,,,,,,,,,,,,,,,,,,,,,,,,,,,,,,,,,,,,,,,,,,,,,,,,,,,,,,,,,,,,,,,,,,,,,,,,,,,,,,Classical,CORE,0.241679735,No,69,Methylated,327,MALE,GBM,,DEAD,100,2.5
TCGA-06-0221,,,,,,,,,,,,,,,,,,,,,,,,,,,,,,,,,,,,,,,,,,,,,,,,,,,,,,,,,,,,,,,,,,,,,,,,,,,,,,,,,,,,,,,,,,Neural,CORE,0.051247652,No,31,Methylated,603,MALE,GBM,40,DEAD,90,5
TCGA-06-0124,,,,,,,,,,,,,,,,,,,,,,,,,,,,,,,,,,,,,,,,,,,,,,,,,,,,,,,,,,,,,,,,,,,,,,,,,,,,,,,,,,,,,,,,,,Mesenchymal,CORE,0.262045823,No,67,Methylated,620,MALE,GBM,70,DEAD,100,10
TCGA-02-0451,,,,,,,,,,,,,,,,,,,,,,,,,,,,,,,,,,,,,,,,,,,,,,,,,,,,,,,,,,,,,,,,,,,,,,,,,,,,,,,,,,,,,,,,,,Neural,CORE,0.15396319,No,62,Unmethlyated,493,FEMALE,GBM,,DEAD,92.5,5
TCGA-08-0392,1.3.6.1.4.1.9328.50.46.285943743580803495108812000858513868023,,36,,90,129,82,115,135,,106,56,13,,,6123,,69,11,71,,,,,,121,126,,,,,47,1,,20,,,30,,,,62,,,,,,,,,,,,,,,,,,,,,,,,,,,,,,,,,,113,,,,,,,,,,,,,,Mesenchymal,CORE,0.243920082,No,60,Unmethlyated,14,MALE,GBM,,DEAD,100,15
TCGA-06-0187,1.3.6.1.4.1.9328.50.45.235490584278690700241909907376060493315,,,,,,,,,,,,,,,,,,,,,,,,,,,,,,,,,,,,,,,,,,,,,,,,,,,,,,,,,,,,,,,,,,,,,,,,,,,,,,,,,,,,,,,,,Classical,CORE,0.070748686,No,69,Methylated,414,MALE,GBM,70,ALIVE,100,10
TCGA-02-0064,,,,,,,,,,,,,,,,,,,,,,,,,,,,,,,,,,,,,,,,,,,,,,,,,,,,,,,,,,,,,,,,,,,,,,,,,,,,,,,,,,,,,,,,,,Mesenchymal,CORE,0.368693722,No,49,Methylated,600,MALE,GBM,100,DEAD,100,2.5
TCGA-08-0389,1.3.6.1.4.1.9328.50.46.89812037130074985280866882521454012644,,,,,,,,,,,,,,,,,,,,,,,,,,,,,,,,,,,,,,,,,,,,,,,,,,,,,,,,,,,,,,,,,,,,,,,,,,,,,,,,,,,,,,,,,Neural,NO,-0.052320938,No,59,Unmethlyated,467,MALE,GBM,,DEAD,95,0
TCGA-06-0130,1.3.6.1.4.1.9328.50.45.98393011316107403302522670305450215676,,,,,,,,,,,,,,,,,,,,,,,,,,,,,,,,,,,,,,,,,,,,,,,,,,,,,,,,,,,,,,,,,,,,,,,,,,,,,,,,,,,,,,,,,Mesenchymal,CORE,0.394096747,No,54,Unmethlyated,358,MALE,GBM,90,DEAD,80,5
TCGA-06-0139,1.3.6.1.4.1.9328.50.45.229090327759241505815737823916031854887,,,,,,,,,,,,,,,,,,,,,,,,,,,,,,,,,,,,,,,,,,,,,,,,,,,,,,,,,,,,,,,,,,,,,,,,,,,,,,,,,,,,,,,,,Mesenchymal,CORE,0.406666929,No,40,Unmethlyated,362,MALE,GBM,60,DEAD,95,0
TCGA-06-0648,1.3.6.1.4.1.9328.50.45.333318729373326851096816118539836558691,,,,,,,,,,,,,,,,,,,,,,,,,,,,,,,,,,,,,,,,,,,,,,,,,,,,,,,,,,,,,,,,,,,,,,,,,,,,,,,,,,,,,,,,,Proneural,CORE,0.359617705,No,78,Methylated,77,MALE,GBM,90,ALIVE,100,10
TCGA-06-0125,1.3.6.1.4.1.9328.50.45.274961689056159317044871434845705348583,,,,,,,,,,,,,,,,,,,,,,,,,,,,,,,,,,,,,,,,,,,,,,,,,,,,,,,,,,,,,,,,,,,,,,,,,,,,,,,,,,,,,,,,,Classical,CORE,0.232557932,No,64,Unmethlyated,1448,FEMALE,GBM,70,DEAD,100,5
TCGA-06-0645,1.3.6.1.4.1.9328.50.45.156123235130961270017396583195552335038,,,,,,,,,,,,,,,,,,,,,,,,,,,,,,,,,,,,,,,,,,,,,,,,,,,,,,,,,,,,,,,,,,,,,,,,,,,,,,,,,,,,,,,,,Mesenchymal,CORE,0.316936085,No,56,Methylated,98,FEMALE,GBM,,ALIVE,97.5,15
TCGA-06-0148,1.3.6.1.4.1.9328.50.45.313232599674425302194214661451609455476,,,,,,,,,,,,,,,,,,,,,,,,,,,,,,,,,,,,,,,,,,,,,,,,,,,,,,,,,,,,,,,,,,,,,,,,,,,,,,,,,,,,,,,,,Classical,CORE,0.064330558,No,76,Unmethlyated,307,MALE,GBM,,DEAD,100,15
TCGA-08-0389,1.3.6.1.4.1.9328.50.46.54194736096707267986043911415995768783,,,,,,,,,,,,,,,,,,,,,,,,,,,,,,,,,,,,,,,,,,,,,,,,,,,,,,,,,,,,,,,,,,,,,,,,,,,,,,,,,,,,,,,,,Neural,NO,-0.052320938,No,59,Unmethlyated,467,MALE,GBM,,DEAD,95,0
TCGA-06-0138,1.3.6.1.4.1.9328.50.45.79663121007425428691829722209212474595,,,,,,,,,,,,,,,,,,,,,,,,,,,,,,,,,,,,,,,,,,,,,,,,,,,,,,,,,,,,,,,,,,,,,,,,,,,,,,,,,,,,,,,,,Neural,CORE,0.141827973,No,43,Unmethlyated,737,MALE,GBM,90,DEAD,97.5,2.5
TCGA-08-0356,1.3.6.1.4.1.9328.50.46.223167225374737301686175635526592579443,,,,,,,,,,,,,,,,,,,,,,,,,,,,,,,,,,,,,,,,,,,,,,,,,,,,,,,,,,,,,,,,,,,,,,,,,,,,,,,,,,,,,,,,,Classical,NO,-0.000119787,No,60,Unmethlyated,945,FEMALE,GBM,,DEAD,87.5,32.5
TCGA-06-0644,1.3.6.1.4.1.9328.50.45.92242096785006000370227906525359327320,,,,,,,,,,,,,,,,,,,,,,,,,,,,,,,,,,,,,,,,,,,,,,,,,,,,,,,,,,,,,,,,,,,,,,,,,,,,,,,,,,,,,,,,,Mesenchymal,CORE,0.343686357,No,72,Unmethlyated,122,MALE,GBM,80,ALIVE,95,20
TCGA-06-0139,1.3.6.1.4.1.9328.50.45.52961006118714181225136792633959450232,,,,,,,,,,,,,,,,,,,,,,,,,,,,,,,,,,,,,,,,,,,,,,,,,,,,,,,,,,,,,,,,,,,,,,,,,,,,,,,,,,,,,,,,,Mesenchymal,CORE,0.406666929,No,40,Unmethlyated,362,MALE,GBM,60,DEAD,95,0
TCGA-08-0246,1.3.6.1.4.1.9328.50.46.259453898066366738635098700728317932208,,,,,,,,,,,,,,,,,,,,,,,,,,,,,,,,,,,,,,,,,,,,,,,,,,,,,,,,,,,,,,,,,,,,,,,,,,,,,,,,,,,,,,,,,Classical,CORE,0.001256484,No,57,Unmethlyated,127,FEMALE,GBM,70,DEAD,87.5,15
TCGA-06-0645,1.3.6.1.4.1.9328.50.45.310100538383598281332238784446073715053,,,,,,,,,,,,,,,,,,,,,,,,,,,,,,,,,,,,,,,,,,,,,,,,,,,,,,,,,,,,,,,,,,,,,,,,,,,,,,,,,,,,,,,,,Mesenchymal,CORE,0.316936085,No,56,Methylated,98,FEMALE,GBM,,ALIVE,97.5,15
TCGA-06-0179,1.3.6.1.4.1.9328.50.45.301991218477984779772852230667812398357,,,,,,,,,,,,,,,,,,,,,,,,,,,,,,,,,,,,,,,,,,,,,,,,,,,,,,,,,,,,,,,,,,,,,,,,,,,,,,,,,,,,,,,,,Neural,CORE,0.213349878,No,64,Methylated,616,MALE,GBM,70,DEAD,90,5
TCGA-08-0360,1.3.6.1.4.1.9328.50.46.103650870268111201936685511415600976957,,,,,,,,,,,,,,,,,,,,,,,,,,,,,,,,,,,,,,,,,,,,,,,,,,,,,,,,,,,,,,,,,,,,,,,,,,,,,,,,,,,,,,,,,Mesenchymal,CORE,0.396407288,No,76,Unmethlyated,468,MALE,GBM,,DEAD,82.5,20
TCGA-06-0648,1.3.6.1.4.1.9328.50.45.56073252494153448390482099884695729532,,,,,,,,,,,,,,,,,,,,,,,,,,,,,,,,,,,,,,,,,,,,,,,,,,,,,,,,,,,,,,,,,,,,,,,,,,,,,,,,,,,,,,,,,Proneural,CORE,0.359617705,No,78,Methylated,77,MALE,GBM,90,ALIVE,100,10
TCGA-06-0158,1.3.6.1.4.1.9328.50.45.173289171872890553883773995785137442742,,,,,,,,,,,,,,,,,,,,,,,,,,,,,,,,,,,,,,,,,,,,,,,,,,,,,,,,,,,,,,,,,,,,,,,,,,,,,,,,,,,,,,,,,Classical,NO,-0.025693185,No,74,Unmethlyated,161,MALE,GBM,80,DEAD,97.5,2.5
TCGA-08-0385,1.3.6.1.4.1.9328.50.46.72175925567538106089341532594904001382,,,,,,,,,,,,,,,,,,,,,,,,,,,,,,,,,,,,,,,,,,,,,,,,,,,,,,,,,,,,,,,,,,,,,,,,,,,,,,,,,,,,,,,,,Proneural,CORE,0.360735346,No,72,NA,82,MALE,GBM,,DEAD,100,7.5
TCGA-06-0185,1.3.6.1.4.1.9328.50.45.119465336371110317602428514946972549076,,,,,,,,,,,,,,,,,,,,,,,,,,,,,,,,,,,,,,,,,,,,,,,,,,,,,,,,,,,,,,,,,,,,,,,,,,,,,,,,,,,,,,,,,Neural,CORE,0.08537733,No,55,Methylated,846,MALE,GBM,100,ALIVE,100,5
TCGA-06-0148,1.3.6.1.4.1.9328.50.45.189309164062399828631351700058370674081,,,,,,,,,,,,,,,,,,,,,,,,,,,,,,,,,,,,,,,,,,,,,,,,,,,,,,,,,,,,,,,,,,,,,,,,,,,,,,,,,,,,,,,,,Classical,CORE,0.064330558,No,76,Unmethlyated,307,MALE,GBM,,DEAD,100,15
TCGA-06-0173,1.3.6.1.4.1.9328.50.45.142899630536134640936339838479026342605,,36,,,,82,,135,,,56,13,,,6123,,69,11,,,,,,111,121,126,,2,,21,47,,105,,,72,30,,,,62,,,116,,130,,,,,,,,,,,,,,,,,,,,,,,,,92,,,,,,,,,,,,,,,,,,Neural,CORE,0.084929651,No,73,Methylated,136,FEMALE,GBM,,DEAD,95,17.5
TCGA-06-0194,,,,,,,,,,,,,,,,,,,,,,,,,,,,,,,,,,,,,,,,,,,,,,,,,,,,,,,,,,,,,,,,,,,,,,,,,,,,,,,,,,,,,,,,,,Mesenchymal,CORE,0.372201447,No,38,Unmethlyated,17,FEMALE,GBM,,DEAD,96.5,1
TCGA-02-0021,,,,,,,,,,,,,,,,,,,,,,,,,,,,,,,,,,,,,,,,,,,,,,,,,,,,,,,,,,,,,,,,,,,,,,,,,,,,,,,,,,,,,,,,,,Classical,CORE,0.276330293,Rec,45,Unmethlyated,2104,FEMALE,GBM,90,DEAD,100,7.5
TCGA-02-0048,,,,,,,,,,,,,,,,,,,,,,,,,,,,,,,,,,,,,,,,,,,,,,,,,,,,,,,,,,,,,,,,,,,,,,,,,,,,,,,,,,,,,,,,,,Proneural,CORE,0.145138572,No,80,Unmethlyated,98,MALE,GBM,,DEAD,100,5
TCGA-06-0139,1.3.6.1.4.1.9328.50.45.237032328085085496059156841298004645642,,,,,,,,,,,,,,,,,,,,,,,,,,,,,,,,,,,,,,,,,,,,,,,,,,,,,,,,,,,,,,,,,,,,,,,,,,,,,,,,,,,,,,,,,Mesenchymal,CORE,0.406666929,No,40,Unmethlyated,362,MALE,GBM,60,DEAD,95,0
TCGA-06-0143,1.3.6.1.4.1.9328.50.45.233411906403442630016187431199490505174,,,,,,,,,,,,,,,,,,,,,,,,,,,,,,,,,,,,,,,,,,,,,,,,,,,,,,,,,,,,,,,,,,,,,,,,,,,,,,,,,,,,,,,,,Mesenchymal,CORE,0.179468852,No,59,Unmethlyated,357,MALE,GBM,70,DEAD,82.5,37.5
TCGA-06-0122,1.3.6.1.4.1.9328.50.45.128296557660865063844963462837810428027,,36,,90,129,82,115,135,31,,,13,,7,,,69,11,71,,,19,,,121,126,,2,46,,,,105,,,,,,,,62,,,,,,,,,,,,,,,,,,,,,,,,,,57,,,,,,,,113,,,,,,,,,,,,,,Mesenchymal,CORE,0.151364179,No,85,Unmethlyated,181,FEMALE,GBM,70,DEAD,100,20
TCGA-02-0102,,,,,,,,,,,,,,,,,,,,,,,,,,,,,,,,,,,,,,,,,,,,,,,,,,,,,,,,,,,,,,,,,,,,,,,,,,,,,,,,,,,,,,,,,,Classical,CORE,0.173196439,Sec,44,Unmethlyated,372,MALE,GBM,100,DEAD,97.5,15
TCGA-06-0143,1.3.6.1.4.1.9328.50.45.151695379056350276166723672192905705834,,36,,90,129,82,,135,,106,56,,48,,6123,,69,11,,,,,,,121,126,,2,,,,,,20,,72,30,,,,,,,116,,,,,,,,,,,,,,611,,,,,,,,,,144,,,,,,,113,,,,,,,,,,,,,,Mesenchymal,CORE,0.179468852,No,59,Unmethlyated,357,MALE,GBM,70,DEAD,82.5,37.5
TCGA-02-0016,,,,,,,,,,,,,,,,,,,,,,,,,,,,,,,,,,,,,,,,,,,,,,,,,,,,,,,,,,,,,,,,,,,,,,,,,,,,,,,,,,,,,,,,,,Classical,CORE,0.071235193,No,50,Methylated,859,MALE,GBM,,DEAD,87.5,0
TCGA-02-0321,,,,,,,,,,,,,,,,,,,,,,,,,,,,,,,,,,,,,,,,,,,,,,,,,,,,,,,,,,,,,,,,,,,,,,,,,,,,,,,,,,,,,,,,,,Proneural,CORE,0.075223989,No,14,Methylated,298,MALE,GBM,,DEAD,100,27.5
TCGA-06-0184,1.3.6.1.4.1.9328.50.45.321645847086394535716470369296365542359,,,,,,,,,,,,,,,,,,,,,,,,,,,,,,,,,,,,,,,,,,,,,,,,,,,,,,,,,,,,,,,,,,,,,,,,,,,,,,,,,,,,,,,,,Mesenchymal,CORE,0.110092916,No,64,Unmethlyated,907,MALE,GBM,90,ALIVE,95,5
TCGA-08-0510,1.3.6.1.4.1.9328.50.46.68057242720190820505546993907432340978,110,36,125,,129,82,115,135,,,56,13,,7,,,69,11,71,,,19,,,121,,,2,,,47,,105,,,,,,,,62,,,,,,,,,,,,,,,,,,,32,,922,,,,,,,,,,,,,,,,,,,,,,,,,,,Mesenchymal,CORE,0.14729116,No,76,Unmethlyated,130,MALE,GBM,80,DEAD,100,10
TCGA-02-0074,,,,,,,,,,,,,,,,,,,,,,,,,,,,,,,,,,,,,,,,,,,,,,,,,,,,,,,,,,,,,,,,,,,,,,,,,,,,,,,,,,,,,,,,,,Proneural,CORE,0.363031477,No,68,Unmethlyated,310,FEMALE,GBM,90,DEAD,100,12.5
TCGA-08-0356,1.3.6.1.4.1.9328.50.46.171974084277888878723881831708703315489,,,,,,,,,,,,,,,,,,,,,,,,,,,,,,,,,,,,,,,,,,,,,,,,,,,,,,,,,,,,,,,,,,,,,,,,,,,,,,,,,,,,,,,,,Classical,NO,-0.000119787,No,60,Unmethlyated,945,FEMALE,GBM,,DEAD,87.5,32.5
TCGA-06-0175,1.3.6.1.4.1.9328.50.45.107647806989195120155174212605063923395,,,,,,,,,,,,,,,,,,,,,,,,,,,,,,,,,,,,,,,,,,,,,,,,,,,,,,,,,,,,,,,,,,,,,,,,,,,,,,,,,,,,,,,,,Mesenchymal,CORE,0.117554096,No,70,Unmethlyated,123,MALE,GBM,100,DEAD,90,0
TCGA-08-0511,1.3.6.1.4.1.9328.50.46.332995732928071158028505514549566500067,110,36,,90,129,82,,135,31,,56,13,,7,,,69,11,71,,,19,,,121,126,,2,,,47,,105,,,,,,,,62,,,116,,,,,,,,,,,,,,,,,,,,,,,,,,,,,,,,,,,,,,,,,,,,,Classical,CORE,0.202604763,No,69,Methylated,235,MALE,GBM,,DEAD,95,10
TCGA-06-0237,1.3.6.1.4.1.9328.50.45.107468877291097869452131637906112882763,,,,,,,,,,,,,,,,,,,,,,,,,,,,,,,,,,,,,,,,,,,,,,,,,,,,,,,,,,,,,,,,,,,,,,,,,,,,,,,,,,,,,,,,,Neural,CORE,0.199904732,No,76,Unmethlyated,415,FEMALE,GBM,40,DEAD,100,5
TCGA-06-0646,1.3.6.1.4.1.9328.50.45.122938438487469439213688075182090634498,,,,,,,,,,,,,,,,,,,,,,,,,,,,,,,,,,,,,,,,,,,,,,,,,,,,,,,,,,,,,,,,,,,,,,,,,,,,,,,,,,,,,,,,,Proneural,CORE,0.051065952,No,61,Unmethlyated,175,MALE,GBM,90,DEAD,95,7.5
TCGA-06-0122,1.3.6.1.4.1.9328.50.45.260055637979439949877155597079563786170,,,,,,,,,,,,,,,,,,,,,,,,,,,,,,,,,,,,,,,,,,,,,,,,,,,,,,,,,,,,,,,,,,,,,,,,,,,,,,,,,,,,,,,,,Mesenchymal,CORE,0.151364179,No,85,Unmethlyated,181,FEMALE,GBM,70,DEAD,100,20
TCGA-02-0071,,,,,,,,,,,,,,,,,,,,,,,,,,,,,,,,,,,,,,,,,,,,,,,,,,,,,,,,,,,,,,,,,,,,,,,,,,,,,,,,,,,,,,,,,,Classical,NO,-0.035006428,No,53,Unmethlyated,167,MALE,GBM,,DEAD,100,10
TCGA-06-0241,1.3.6.1.4.1.9328.50.45.316434438257717295392918423241282910142,,,,,,,,,,,,,,,,,,,,,,,,,,,,,,,,,,,,,,,,,,,,,,,,,,,,,,,,,,,,,,,,,,,,,,,,,,,,,,,,,,,,,,,,,Proneural,CORE,0.308672449,No,66,Methylated,198,FEMALE,GBM,40,ALIVE,100,7.5
TCGA-08-0359,1.3.6.1.4.1.9328.50.46.326620952159247330272267202682987269982,,,,,,,,,,,,,,,,,,,,,,,,,,,,,,,,,,,,,,,,,,,,,,,,,,,,,,,,,,,,,,,,,,,,,,,,,,,,,,,,,,,,,,,,,Proneural,CORE,0.101501164,No,60,Methylated,103,FEMALE,GBM,,DEAD,87.5,5
TCGA-08-0385,1.3.6.1.4.1.9328.50.46.114980853275333443510996646882618917389,,,,,,,,,,,,,,,,,,,,,,,,,,,,,,,,,,,,,,,,,,,,,,,,,,,,,,,,,,,,,,,,,,,,,,,,,,,,,,,,,,,,,,,,,Proneural,CORE,0.360735346,No,72,NA,82,MALE,GBM,,DEAD,100,7.5
TCGA-06-0175,1.3.6.1.4.1.9328.50.45.142848244588498823698376270666633139972,,,,,,,,,,,,,,,,,,,,,,,,,,,,,,,,,,,,,,,,,,,,,,,,,,,,,,,,,,,,,,,,,,,,,,,,,,,,,,,,,,,,,,,,,Mesenchymal,CORE,0.117554096,No,70,Unmethlyated,123,MALE,GBM,100,DEAD,90,0
TCGA-06-0137,1.3.6.1.4.1.9328.50.45.305227854284090555965781589764469550629,,,,,,,,,,,,,,,,,,,,,,,,,,,,,,,,,,,,,,,,,,,,,,,,,,,,,,,,,,,,,,,,,,,,,,,,,,,,,,,,,,,,,,,,,Classical,CORE,0.221526248,No,64,Unmethlyated,812,FEMALE,GBM,90,DEAD,92.5,2.5
TCGA-06-0177,1.3.6.1.4.1.9328.50.45.313637961127064534809526531512899358895,,,,,,,,,,,,,,,,,,,,,,,,,,,,,,,,,,,,,,,,,,,,,,,,,,,,,,,,,,,,,,,,,,,,,,,,,,,,,,,,,,,,,,,,,Proneural,CORE,0.269598906,No,64,Unmethlyated,127,MALE,GBM,70,DEAD,92.5,2.5
TCGA-06-0130,1.3.6.1.4.1.9328.50.45.296118904200952959225417317679078263218,,,,,,,,,,,,,,,,,,,,,,,,,,,,,,,,,,,,,,,,,,,,,,,,,,,,,,,,,,,,,,,,,,,,,,,,,,,,,,,,,,,,,,,,,Mesenchymal,CORE,0.394096747,No,54,Unmethlyated,358,MALE,GBM,90,DEAD,80,5
TCGA-06-0173,1.3.6.1.4.1.9328.50.45.279489971995610736530982900798698430331,,,,,,,,,,,,,,,,,,,,,,,,,,,,,,,,,,,,,,,,,,,,,,,,,,,,,,,,,,,,,,,,,,,,,,,,,,,,,,,,,,,,,,,,,Neural,CORE,0.084929651,No,73,Methylated,136,FEMALE,GBM,,DEAD,95,17.5
TCGA-02-0034,,,,,,,,,,,,,,,,,,,,,,,,,,,,,,,,,,,,,,,,,,,,,,,,,,,,,,,,,,,,,,,,,,,,,,,,,,,,,,,,,,,,,,,,,,Mesenchymal,CORE,0.375636901,No,61,Unmethlyated,430,MALE,GBM,80,DEAD,100,15
TCGA-08-0522,1.3.6.1.4.1.9328.50.46.158696227902295886606720382429946330129,110,36,,,129,82,,135,,106,,13,,,6123,,69,11,71,120,,19,,,,126,91,2,,,47,,,,,,30,,,,62,,,116,,,,,,,,,,,,,,,,,,,,,,,57,,,,,,,,,,,,,,,,,,,,,,Mesenchymal,CORE,0.331197169,No,61,Unmethlyated,635,MALE,GBM,,DEAD,87.5,37.5
TCGA-08-0352,1.3.6.1.4.1.9328.50.46.259525398432947997437241912112952340663,,,,,,,,,,,,,,,,,,,,,,,,,,,,,,,,,,,,,,,,,,,,,,,,,,,,,,,,,,,,,,,,,,,,,,,,,,,,,,,,,,,,,,,,,Mesenchymal,CORE,0.166218899,No,80,Unmethlyated,39,MALE,GBM,,DEAD,80,15
TCGA-06-0175,1.3.6.1.4.1.9328.50.45.4575011658710460877566585488950065291,,,,,,,,,,,,,,,,,,,,,,,,,,,,,,,,,,,,,,,,,,,,,,,,,,,,,,,,,,,,,,,,,,,,,,,,,,,,,,,,,,,,,,,,,Mesenchymal,CORE,0.117554096,No,70,Unmethlyated,123,MALE,GBM,100,DEAD,90,0
TCGA-08-0392,1.3.6.1.4.1.9328.50.46.148265491994714714175652183317426027232,,,,,,,,,,,,,,,,,,,,,,,,,,,,,,,,,,,,,,,,,,,,,,,,,,,,,,,,,,,,,,,,,,,,,,,,,,,,,,,,,,,,,,,,,Mesenchymal,CORE,0.243920082,No,60,Unmethlyated,14,MALE,GBM,,DEAD,100,15
TCGA-06-0139,1.3.6.1.4.1.9328.50.45.214263536780866618019280023057541485137,,,,,,,,,,,,,,,,,,,,,,,,,,,,,,,,,,,,,,,,,,,,,,,,,,,,,,,,,,,,,,,,,,,,,,,,,,,,,,,,,,,,,,,,,Mesenchymal,CORE,0.406666929,No,40,Unmethlyated,362,MALE,GBM,60,DEAD,95,0
TCGA-08-0352,1.3.6.1.4.1.9328.50.46.273255727733399439043422333634782326838,,,,,,,,,,,,,,,,,,,,,,,,,,,,,,,,,,,,,,,,,,,,,,,,,,,,,,,,,,,,,,,,,,,,,,,,,,,,,,,,,,,,,,,,,Mesenchymal,CORE,0.166218899,No,80,Unmethlyated,39,MALE,GBM,,DEAD,80,15
TCGA-08-0518,1.3.6.1.4.1.9328.50.46.43695885068500792151066518314302027722,,,,,,,,,,,,,,,,,,,,,,,,,,,,,,,,,,,,,,,,,,,,,,,,,,,,,,,,,,,,,,,,,,,,,,,,,,,,,,,,,,,,,,,,,Classical,CORE,0.204110492,No,60,Unmethlyated,588,FEMALE,GBM,,DEAD,100,30